{"text_format":"1","workbook":"xlsx","n_sheets":4,"sheets":["Récap","Fiches","stats","FormatFiche"],"not_rendered":{"charts":0,"images":199,"macros":1,"external_links":0,"defined_names":21,"comments":0,"pivot_tables":0},"unopened":[],"bounds":{"document_bytes":16777216,"sheet_cells":100000,"rows_first":2000,"rows_last":500,"rows_between":2000,"halvings":0,"cell_chars":16384,"cell_head_chars":4096},"cells_cut":0,"cells_raw":0,"read":"whole","date_system":"1900"}

{"sheet":"Récap","index":0,"n_rows":120,"n_cols":13,"rows_kept":120,"cut":false,"hidden":false,"merged":[]}
[]
[]
[]
[]
[null,1,2,3,4,5,6,7,8,9,10,11,12]
["Produit","Type de solution","Classe produit","Type de bâtiments visés","Fabricant","Matériaux","Disponibilité Pays","Stade d'évolution","En quoi est-ce démontable ?","Descriptif","Site source","Liens","Images"]
["Assemblage Poteau / Toit","Système constructif","Assemblage","Tout type","?","Divers","Inconnue","Diffusion limitée","Fixation mécanique par tige filetée","La tige filetée a une durée de vie importante et permet de ne pas mettre en péril la structure assemblée en nécessitant un remplacement de l'élément assembleur.","Publication","Transformable_building_structures"]
["Ensemble plancher / revêtement / cloisons démontables 1","Système constructif","Assemblage","Sauf habitat individuel","Etat Canadien","Divers","France","Recherche et Développement","Assemblage par fixation mécanique","Voir schéma :\nStructure de plancher en dalles béton précontraintes sur profilés métalliques, plancher bois sur plots, cloisons démontables, réseaux passés entre le revêtement sur plot et la structure du plancher.","Publication","DfD_Guide_OfficeBldgs"]
["Ensemble plancher / revêtement / cloisons démontables 2","Système constructif","Assemblage","Sauf habitat individuel","Etat Canadien","Divers","France","Recherche et Développement","Assemblage par fixation mécanique","Voir schéma :\nPlancher en dalle béton sur bac métallique nervuré, posé sur structure métallique en profilés à âme évidée, faux plafond sous suspentes, passage des réseaux en faux plafond.","Publication","DfD_Guide_OfficeBldgs"]
["Liaison plancher / façade préfabriqués","Système constructif","Assemblage","Tout type","Etat Canadien","Divers","France","Recherche et Développement","Assemblage par fixation mécanique","Voir schéma :\nDétail De section intérieure avec plancher en béton pré contraint fixé sur profilé métallique, panneaux de façade préfabriqués\nTrappe d'accès à l'élément d'assemblage plancher / panneau de façade supérieur.","Publication","DfD_Guide_OfficeBldgs"]
{"$rows_left_out":111}
{"sheet":"Fiches","index":1,"n_rows":20,"n_cols":94,"rows_kept":20,"cut":false,"hidden":false,"merged":[]}
[]
[]
[null,"Classement (1 : OK, 2 : indirect, 3: éloigné)",1,1,1,1,1,1,1,1,1,1,1,1,null,2,1,2,1,1,1,1,1,2,1,1,1,1,1,1,1,1,1,1,1,1,1,1,1,1,1,1,1,1,1,1,2,2,1,1,1,1,1,1,1,1,1,1,1,1,1,1,1,1,1,null,null,1,1,1,1,1,1,1,1,null,null,1,2,1,1]
[null,"Commentaire",null,"Pas pour bâtiment d'habitation ou régis par le code de la construction, pour terrasses, abris, structures légères de loisir",null,null,"Assemblage non structurel","Pas démontable si utilisation de colle.\nAttention également avec les pièces d'assemblage en bois qui avec le temps travaillent et rendent l'assemblage indémontable\nPour la démontabilité, assemblage bout à bout intéressant mais sans pièce de bois de liaison","Possible pour bâtiments de grandes dimensions, industriel, tertiaire… Difficile pour le logement",null,"Pour structures lourdes. Peu adapté au logement individuel","?? De quoi il s'agit ?","Pour structures lourdes. Peu adapté au logement individuel","Pour structures lourdes. Peu adapté au logement individuel",null,null,null,null,null,null,"Aménagement extérieur",null,null,"Expliquer l'intérêt par rapport à un climatiseur normal. Déplaçable, pas de fixation, peut être disposé dans les pièces qui en ont besoin, optimisation",null,null,null,null,null,"A quoi ça sert ?",null,null,null,null,null,"Plutôt pour des bâtiments de grandes dimensions","Plutôt pour des bâtiments de grandes dimensions",null,null,null,null,null,null,"Détails sur la démontabilité réelle ? Démontabilité des panneaux entre eux ou des composants du plancher ?","A part si info supplémentaire, Pas pour tout type de bâtiment. Pour les structures non habitables, légères, terrasses...",null,"Faire commentaire. C'est le système qui est démontable ou intéressant car décentralisé ?","Je ne vois pas en quoi c'est particulièrement démontable",null,null,null,null,"Très diffusée ?",null,null,null,"Goulotte non ???",null,null,null,"Pour Structures légères. Pas de bâtiment d'habitation ou structure de toiture de terrasse",null,"Comment ça se démonte ?",null,null,null,"Lien source local.","Idée similaire au précédent. Démontage facile du produit car en Velcro ?",null,null,"Très courant. ",null,null,null,null,"intérêt éléments métalliques ?","doublon"]
[]
[null,"Produit","Assemblage Poteau / Toit","Ensemble plancher / revêtement / cloisons démontables 1","Ensemble plancher / revêtement / cloisons démontables 2","Liaison plancher / façade préfabriqués","Liaison plancher façades métallique","Assemblage de fenêtre par chevauchement","Liaison mur / toit","Liaison plancher / cloison ","Mur pour intégration prises électriques évolutives","Plancher Béton Préfabriqué Démontable : Bestcon 30","Plancher Béton Préfabriqué Démontable : Cd 20","Plancher Béton Préfabriqué Démontable : Matrixbow","Core Wall","Plancher creux","Connexions Indirects","Séparation des éléments au sein d'un plancher","Armoire Électrique","Assemblage autour d'une étoile à 4 côtés","Assemblage Bout À Bout","Assemblage Démontable pour structure métallique","Assemblage façades Centre Pompidou","Assemblage façades Yacht House","Assemblage poteau / toit structure métallique","Bloc Fixation Wc","Charpente Métallique","Cloison Démontable Sgc Clip-In","Cloisons Amovibles Et Démontables","Complexe constructif bois","Connexion nœud","Groupe Chauffage Autonome","Imposte De Porte Démontable","Joint Spline - Assemblage structure bois","Jonction Plancher / Murs Verticaux","Montant De Menuiserie Démontable","Montant De Menuiserie Démontable","Nœud d'assemblage rotulien de structure métallique","Panneaux De Plancher Métalliques","Plinthes pour passage de réseaux","Thermasteel","Truss Connexion - Assemblage toiture paroi","Faux plafond bois - fixation par clips","Revêtement murale aimanté","Faux plafond bois - fixation par crochets","Plinthe En Liège","\"Velcro\" Métallique","Adhésif Sur Panneaux De Bois Intérieur","Assemblage métallique simplifié","Assemblage par glissement","Assemblage triangulaire","Bâche De Toit Simple et Double Peau","Boite de réservation","Brise-soleils","Calles Fixation Bardage","Chaussette isolante pour Éléments De Tuyauterie","Clips Pour Revêtements de sol","Clips Sur Panneaux De Bois Intérieur","Clous À Deux Têtes","Dalle Autoporteuse Terrasse Préassemblé Pin","Elément d'encrage vissable","Fixation Invis","Fixation Par Velcro","Fondations Vissables","Rails de maintien de bardage intérieur bois","Manchons De repérage de Câbles","Pied De Poteau métallique Vissable","Pieux Vissés","Plafond Thermo fixé","Plaque de Faux-Plafond","Platines et support Réglables pour Terrasse","Plots Réglables pour Terrasse","Raccords hydrauliques flexibles","Revêtement de sol adaptable (Land Peel Furniture)","Revêtement Routier En Kit","Rondelle Thermo-Réactive","Sabot De Solivage","Sol Pvc sans colle 25M²","Système d'assemblage pour structure","Système De Fixation de Faux-Plafond","Système de joint pour pavés","Système de Mur de Rétention Modulaire","Technologie De Fondations à Faible Impact (L.I.F.T.)","Terrasse Pin Clipsée","Maçonnerie sans joints post tendue","AGRIBOARD","Rail","Plancher","Bolted Column Connection ","REDUCE","Connecteurs KNAPP (RICON - FASCO)","HALFEN","Cassette Longitude","Façade F4"]
[1,"Type de solution","Système constructif","Système constructif","Système constructif","Système constructif","Système constructif","Système constructif","Système constructif","Système constructif","Système constructif","Système constructif","Système constructif","Système constructif","Système constructif","Système constructif","Mode constructif","Mode constructif","Complexe","Complexe","Complexe","Complexe","Complexe","Complexe","Complexe","Complexe","Complexe","Complexe","Complexe","Complexe","Complexe","Complexe","Complexe","Complexe","Complexe","Complexe","Complexe","Complexe","Complexe","Complexe","Complexe","Complexe","Complexe","Complexe","Complexe","Complexe","Elément","Elément","Elément","Elément","Elément","Elément","Elément","Elément","Elément","Elément","Elément","Elément","Elément","Elément","Elément","Elément","Elément","Elément","Elément","Elément","Elément","Elément","Elément","Elément","Elément","Elément","Elément","Elément","Elément","Elément","Elément","Elément","Elément","Elément","Elément","Elément","Elément","Elément","Système constructif","système constructif","Elément","Système constructif","Elément","Système constructif","Elément","Elément","Element","Système constructif"]
[2,"Classe produit","Assemblage","Assemblage","Assemblage","Assemblage","Assemblage","Assemblage","Assemblage","Structure","Assemblage","Assemblage","Assemblage","Structure","Structure","Structure","Assemblage","Structure","Electricité","Assemblage","Charpente","Assemblage","Assemblage","Assemblage","Assemblage","Sanitaires","Structure","Menuiserie intérieure","Cloisonnement intérieur","Structure","Assemblage","Chauffage","Menuiserie intérieure","Assemblage","Structure","Menuiserie extérieure","Menuiserie extérieure","Assemblage","Structure","Accessoire","Structure","Assemblage","Plafond","Revêtement intérieur","Plafond","Revêtement intérieur","Assemblage","Revêtement intérieur","Assemblage","Assemblage","Assemblage","Couverture","Accessoire","Protection solaire","Assemblage","Canalisation","Assemblage","Revêtement intérieur","Assemblage","Revêtement de sol","Fondation","Assemblage","Assemblage","Fondation","Revêtement intérieur","Electricité","Assemblage","Fondation","Plafond","Plafond","Structure","Structure","Canalisation","Revêtement intérieur","Revêtement extérieur","Assemblage","Structure","Revêtement de sol","Assemblage","Plafond","Assemblage","Structure","Fondation","Revêtement de sol","Structure","Assemblage","Assemblage","Structure","Assemblage","Assemblage","Assemblages","Assemblage","Bardage","Paroi"]
[3,"Type de bâtiments visés","Tout type","Sauf habitat individuel","Sauf habitat individuel","Tout type","Tout type","Tout type","Tout type","Tout type","Tout type","Tout type","Tout type","Tout type","Tout type","Tout type","Tout type","Tout type","Tout type","Tout type","Tout type","Industriel","Sauf habitat individuel","Tout type","Industriel","Tout type","Industriel","Tout type","Tout type","Habitat individuel","Tout type","Industriel","Tout type","Tout type","Tout type","Tout type","Tout type","Tout type","Tout type","Tout type","Tout type","Tout type","Tout type","Tout type","Tout type","Tout type","Tout type","Tout type","Sauf habitat individuel","Sauf habitat individuel","Sauf habitat individuel","Industriel","Tout type","Tout type","Tout type","Industriel","Tout type","Tout type","Tout type","Tout type","Structures légères","Tout type","Tout type","Tout type","Tout type","Tout type","Structures légères","Tout type","Tout type","Tout type","Tout type","Tout type","Tout type","Tout type","Tout type","Tout type","Tout type","Tout type","Tout type","Tout type","Tout type","Tout type","Tout type","Tout type","tout type","Tout type","tout type","Tout type","Tout type","Tout type","Tout type","Tout type","Tout type","Tout type "]
[4,"Fabricant","?","Etat Canadien","Etat Canadien","Etat Canadien","Etat Canadien","?","?","?","?","Netherland","Netherland","Netherland","Bensonwood","Bensonwood","?","?","Legrand","?","Non spécifié","Universidad Politécnica de Cartagena","?","?","spaciotempo","ErgoWall","Galco (France Métal)","Dispano","ABCD International","?","?","Losberger","Malerba","Bensonwood","Gipen","?","?","Alexis Rochas","?","?","Thermasteel","?","Hunter Douglas","W-all Ventures","Arotcharen","Alsacork","Metaklett","?","?","Quicon","Emilio Perez Piñero","Omega Structures","Uniboite","Uniform","Piveteau","Carbone +","Piveteau","?","?","Piveteau","Fixtoo","Lamello","Velcro","Krinner","?","Legrand","Avenue du bois","Technopieux","Luxtend","Knauf","Piveteau","Piveteau","?","Felipe zanardi","Non spécifié","?","Piveteau","Gerflor","?","Placo","?","/","?","Piveteau","Kyushu University","Agriboard","Grad","?","PEIKKO",null,"KNAPP","HALFEN","Laude","ISOVER"]
{"$rows_left_out":11}
{"sheet":"stats","index":2,"n_rows":39,"n_cols":30,"rows_kept":39,"cut":false,"hidden":false,"merged":[]}
[]
[]
[null,null,"Site source","Fabricant",{"$f":"COUNTIF(listesource,D3)","v":31},{"$f":"E3/$E$11","v":0.38271604938271603},"Stade d'évolution","Recherche et Développement",{"$f":"COUNTIF(listediffusion,H3)","v":8},"Classe produit","Accessibilité",{"$f":"COUNTIF(listeclasse,K3)","v":0},{"$f":"L3/$L$27","v":0},"Type de solution","Elément",{"$f":"COUNTIF(listesolution,O3)","v":38},{"$f":"P3/$P$8","v":0.46341463414634149},"Typologie de bâtiments visés","Tout type",{"$f":"COUNTIF(listetypebat,S3)","v":67},null,"Matériaux","Métal",{"$f":"COUNTIF(listemateriau,W3)","v":28},{"$f":"X3/$X$28","v":0.34146341463414637},"Disponibilité","France",{"$f":"COUNTIF(listepays,AA3)","v":48},{"$f":"AB3/$AB$16","v":0.58536585365853655},"Allemagne"]
[null,null,null,"Publication",41,0.50617283950617287,null,"Diffusion limitée",{"$f":"COUNTIF(listediffusion,H4)","v":36},null,"Accessoire",2,2.4390243902439025E-2,null,"Complexe",{"$f":"COUNTIF(listesolution,O4)","v":28},{"$f":"P4/$P$8","v":0.34146341463414637},null,"Industriel",{"$f":"COUNTIF(listetypebat,S4)","v":6},null,null,"Divers",18,0.21951219512195122,null,"Inconnue",13,0.15853658536585366,"Belgique"]
[null,null,null,"Site spécialisé",6,7.407407407407407E-2,null,"Très diffusé",{"$f":"COUNTIF(listediffusion,H5)","v":38},null,"Assemblage",33,0.40243902439024393,null,"Système constructif",{"$f":"COUNTIF(listesolution,O5)","v":14},{"$f":"P5/$P$8","v":0.17073170731707318},null,"Structures légères",{"$f":"COUNTIF(listetypebat,S5)","v":2},null,null,"Bois",10,0.12195121951219512,null,"USA",8,9.7560975609756101E-2,"Espagne"]
[null,null,null,"Revendeur",2,2.4691358024691357E-2,null,null,null,null,"Canalisation",2,2.4390243902439025E-2,null,"Mode constructif",{"$f":"COUNTIF(listesolution,O6)","v":2},{"$f":"P6/$P$8","v":2.4390243902439025E-2},null,"Sauf habitat individuel",{"$f":"COUNTIF(listetypebat,S6)","v":6},null,null,"PVC",6,7.3170731707317069E-2,null,"USA, UK, Japon, Canada",3,3.6585365853658534E-2,"France"]
[null,null,null,"Nobatek",1,1.2345679012345678E-2,null,"TOTAL",{"$f":"SUM(I3:I5)","v":82},null,"Charpente",1,1.2195121951219513E-2,null,null,null,null,null,"Habitat individuel",{"$f":"COUNTIF(listetypebat,S7)","v":1},null,null,"Bois, Divers",2,2.4390243902439025E-2,null,"Pays-Bas",3,3.6585365853658534E-2,"Inconnue"]
[null,null,null,"Batiproduits",0,0,null,null,null,null,"Chauffage",1,1.2195121951219513E-2,null,"TOTAL",{"$f":"SUM(P3:P6)","v":82},null,null,null,null,null,null,"Liège naturel",1,1.2195121951219513E-2,null,"Belgique",2,2.4390243902439025E-2,"Japon"]
[null,null,null,"Forum",0,0,null,null,null,null,"Climatisation",0,0,null,null,null,null,null,"TOTAL",{"$f":"SUM(T3:T7)","v":82},null,null,"Béton, Métal",3,3.6585365853658534E-2,null,"UK",2,2.4390243902439025E-2,"Pays-Bas"]
[null,null,null,null,null,null,null,null,null,null,"Cloisonnement intérieur",1,1.2195121951219513E-2,null,null,null,null,null,null,null,null,null,"Velcro",2,2.4390243902439025E-2,null,"Allemagne",1,1.2195121951219513E-2,"UK"]
{"$rows_left_out":30}
{"sheet":"FormatFiche","index":3,"n_rows":17,"n_cols":8,"rows_kept":17,"cut":false,"hidden":false,"merged":[[3,4,3,5],[6,3,16,3],[10,5,12,7],[9,5,9,7],[8,5,8,6],[6,5,6,6],[7,5,7,6],[5,5,5,6],[4,4,4,7],[15,4,15,7],[16,4,16,7],[14,4,14,7],[3,3,4,3],[13,4,13,7],[3,6,3,7]]}
[]
[]
[]
[null,null,null,null,"Fiche Matériau N°",null,{"$f":"INDEX(OFFSET(listeproduit,Fiches!A19,0),MATCH($E$5,listeproduit,0))","v":1}]
[null,null,null,null,"Assemblage Poteau / Toit"]
[null,null,null,"Illustrations","Classe produit","Matériaux",null,"Source"]
[null,null,null,null,{"$f":"INDEX(OFFSET(listeproduit,Fiches!A8,0),MATCH($E$5,listeproduit,0))","v":"Assemblage"},{"$f":"INDEX(OFFSET(listeproduit,Fiches!A11,0),MATCH($E$5,listeproduit,0))","v":"Divers"},null,{"$f":"INDEX(OFFSET(listeproduit,Fiches!A16,0),MATCH($E$5,listeproduit,0))","v":"Publication"}]
[null,null,null,null,"Type de bâtiment visé","Disponibilité Pays",null,"Stade d'évolution"]
[null,null,null,null,{"$f":"INDEX(OFFSET(listeproduit,Fiches!A9,0),MATCH($E$5,listeproduit,0))","v":"Tout type"},{"$f":"INDEX(OFFSET(listeproduit,Fiches!A12,0),MATCH($E$5,listeproduit,0))","v":"Inconnue"},null,{"$f":"INDEX(OFFSET(listeproduit,Fiches!A13,0),MATCH($E$5,listeproduit,0))","v":"Diffusion limitée"}]
[null,null,null,null,"Type de solution","En quoi est-ce démontable ?"]
{"$rows_left_out":7}