{"text_format":"1","workbook":"xlsx","n_sheets":9,"sheets":["Accueil","Gaz Année","Gaz Saison de chauffe","Fioul Année","Fioul Saison de chauffe","CPCU Année","CPCU Saison de chauffe","Aide","DJU Montsouris"],"not_rendered":{"charts":63,"images":1,"macros":1,"external_links":0,"defined_names":0,"comments":0,"pivot_tables":0},"unopened":[],"bounds":{"document_bytes":16777216,"sheet_cells":100000,"rows_first":2000,"rows_last":500,"rows_between":2000,"halvings":0,"cell_chars":16384,"cell_head_chars":4096},"cells_cut":0,"cells_raw":0,"read":"whole","date_system":"1900"}

{"sheet":"Accueil","index":0,"n_rows":13,"n_cols":10,"rows_kept":13,"cut":false,"hidden":false,"merged":[]}
[]
[null,null,null,null,"Bilan Énergétique Simplifié"]
[1,null,null,null,null,null,"chauffage collectif"]
[]
[]
[null,"-","Votre installation comprend-t-elle la production d'eau chaude sanitaire collective ?"]
[null,"-","Choisissez un type d'énergie et la période de chauffe considérée :"]
[]
[]
[]
[]
[null,"Gaz",null,null,null,"Fioul",null,null,null,"Réseau de chaleur"]
[null,null,null,null,null,null,null,null,null,"(CPCU...)"]

{"sheet":"Gaz Année","index":1,"n_rows":151,"n_cols":10,"rows_kept":151,"cut":false,"hidden":false,"merged":[[1,3,1,8],[2,2,3,2],[2,3,3,3],[2,4,3,4],[2,5,3,5],[2,6,2,7],[126,2,126,4],[103,5,104,5],[103,4,104,4],[103,6,103,7],[102,2,102,8],[51,3,51,18],[103,1,104,1],[103,2,104,2],[103,3,104,3],[25,2,25,4],[103,17,104,17]]}
[null,null,null,null,"Analyse des consommations de chauffage (Gaz)"]
[null,null,null,{"$f":"IF(Accueil!A3=2,\"\",\"Attention, vous avez spécifié sur la page Accueil être en chauffage collectif AVEC eau chaude sanitaire\")","v":"Attention, vous avez spécifié sur la page Accueil être en chauffage collectif AVEC eau chaude sanitaire"}]
[null,null,"Année","Consommation Chauffage (kWh)","Facture chauffage (€ TTC)","Surface habitable chauffée (m2)","Période de chauffe (jj/mm/aaaa)"]
[null,null,null,null,null,null,"Fermeture","Ouverture"]
[null,null,2009,null,null,null,null,null,{"$f":"IF(OR(AND(G5=\"\",H5<>\"\"),AND(G5<>\"\",H5=\"\")),\"Veuillez remplir les deux dates\",IF(AND(G5=\"\",H5=\"\"),\"\",IF(AND((YEAR(G5))=C5,(YEAR(H5))=C5),\"\",CONCATENATE(\"Attention, les dates de la 'période de chauffe' ne correspondent pas à \",C5) )))","v":""}]
[null,null,2010,null,null,null,null,null,""]
[null,null,2011,null,null,null,null,null,""]
[null,null,2012,null,null,null,null,null,""]
[null,null,2013,null,null,null,null,null,""]
[null,null,2014,null,null,null,null,null,""]
[null,null,2015,null,null,null,null,null,""]
[null,null,2016,null,null,null,null,null,""]
[null,null,null,null,null,null,null,null,""]
[]
[]
[]
[]
[]
[]
[]
[]
[]
[]
[]
[]
[]
[]
[]
[]
[]
[]
[]
[]
[]
[]
[null,null,"Année","Consommation chauffage par DJU","Simulation consommation chauffage sans dérive (kWh)","Consommation relative (kWh/m2)","Nombre de DJU","Evolution prix du kWh"]
[null,null,{"$f":"C5","v":2009},{"$f":"IF(D5<>\"\",D5/G37,#N/A)","v":{"$error":"#N/A"}},{"$f":"(INDEX($D$5:$D$13,(MIN(IF(ISBLANK($D$5:$D$13),ROW($D$14),ROW($D$5:$D$13))))-ROW($G$4),1))*G37/(INDEX($G$37:$G$45,(MIN(IF(ISBLANK($D$5:$D$13),ROW($D$14),ROW($D$5:$D$13))))-ROW($G$4),1))","v":{"$error":"#REF!"}},{"$f":"IF(D5=\"\",\"\",D5/F5)","v":""},{"$f":"IF(OR(G5=\"\",H5=\"\"), \"Dates de chauffe à renseigner\", SUM(INDEX('DJU Montsouris'!B:B,MATCH(DATE(YEAR(G5),1,1),'DJU Montsouris'!A:A,0),1):INDEX('DJU Montsouris'!B:B,MATCH(G5,'DJU Montsouris'!A:A,0),1),INDEX('DJU Montsouris'!B:B,MATCH(H5,'DJU Montsouris'!A:A,0),1):INDEX('DJU Montsouris'!B:B,MATCH(DATE(YEAR(G5),12,31),'DJU Montsouris'!A:A,0),1)))","v":"Dates de chauffe à renseigner"},{"$f":"IF(AND(D5<>\"\",E5<>\"\"),E5/D5*100,#N/A)","v":{"$error":"#N/A"}}]
[null,null,{"$f":"C6","v":2010},{"$f":"IF(D6<>\"\",D6/G38,#N/A)","v":{"$error":"#N/A"}},{"$f":"(INDEX($D$5:$D$13,(MIN(IF(ISBLANK($D$5:$D$13),ROW($D$14),ROW($D$5:$D$13))))-ROW($G$4),1))*G38/(INDEX($G$37:$G$45,(MIN(IF(ISBLANK($D$5:$D$13),ROW($D$14),ROW($D$5:$D$13))))-ROW($G$4),1))","v":{"$error":"#REF!"}},{"$f":"IF(D6=\"\",\"\",D6/F6)","v":""},{"$f":"IF(OR(G6=\"\",H6=\"\"), \"Dates de chauffe à renseigner\", SUM(INDEX('DJU Montsouris'!B:B,MATCH(DATE(YEAR(G6),1,1),'DJU Montsouris'!A:A,0),1):INDEX('DJU Montsouris'!B:B,MATCH(G6,'DJU Montsouris'!A:A,0),1),INDEX('DJU Montsouris'!B:B,MATCH(H6,'DJU Montsouris'!A:A,0),1):INDEX('DJU Montsouris'!B:B,MATCH(DATE(YEAR(G6),12,31),'DJU Montsouris'!A:A,0),1)))","v":"Dates de chauffe à renseigner"},{"$error":"#N/A"}]
[null,null,2011,{"$error":"#N/A"},{"$f":"(INDEX($D$5:$D$13,(MIN(IF(ISBLANK($D$5:$D$13),ROW($D$14),ROW($D$5:$D$13))))-ROW($G$4),1))*G39/(INDEX($G$37:$G$45,(MIN(IF(ISBLANK($D$5:$D$13),ROW($D$14),ROW($D$5:$D$13))))-ROW($G$4),1))","v":{"$error":"#REF!"}},{"$f":"IF(D7=\"\",\"\",D7/F7)","v":""},{"$f":"IF(OR(G7=\"\",H7=\"\"), \"Dates de chauffe à renseigner\", SUM(INDEX('DJU Montsouris'!B:B,MATCH(DATE(YEAR(G7),1,1),'DJU Montsouris'!A:A,0),1):INDEX('DJU Montsouris'!B:B,MATCH(G7,'DJU Montsouris'!A:A,0),1),INDEX('DJU Montsouris'!B:B,MATCH(H7,'DJU Montsouris'!A:A,0),1):INDEX('DJU Montsouris'!B:B,MATCH(DATE(YEAR(G7),12,31),'DJU Montsouris'!A:A,0),1)))","v":"Dates de chauffe à renseigner"},{"$error":"#N/A"}]
[null,null,2012,{"$error":"#N/A"},{"$f":"(INDEX($D$5:$D$13,(MIN(IF(ISBLANK($D$5:$D$13),ROW($D$14),ROW($D$5:$D$13))))-ROW($G$4),1))*G40/(INDEX($G$37:$G$45,(MIN(IF(ISBLANK($D$5:$D$13),ROW($D$14),ROW($D$5:$D$13))))-ROW($G$4),1))","v":{"$error":"#REF!"}},"",{"$f":"IF(OR(G8=\"\",H8=\"\"), \"Dates de chauffe à renseigner\", SUM(INDEX('DJU Montsouris'!B:B,MATCH(DATE(YEAR(G8),1,1),'DJU Montsouris'!A:A,0),1):INDEX('DJU Montsouris'!B:B,MATCH(G8,'DJU Montsouris'!A:A,0),1),INDEX('DJU Montsouris'!B:B,MATCH(H8,'DJU Montsouris'!A:A,0),1):INDEX('DJU Montsouris'!B:B,MATCH(DATE(YEAR(G8),12,31),'DJU Montsouris'!A:A,0),1)))","v":"Dates de chauffe à renseigner"},{"$error":"#N/A"}]
[null,null,2013,{"$error":"#N/A"},{"$f":"(INDEX($D$5:$D$13,(MIN(IF(ISBLANK($D$5:$D$13),ROW($D$14),ROW($D$5:$D$13))))-ROW($G$4),1))*G41/(INDEX($G$37:$G$45,(MIN(IF(ISBLANK($D$5:$D$13),ROW($D$14),ROW($D$5:$D$13))))-ROW($G$4),1))","v":{"$error":"#REF!"}},"",{"$f":"IF(OR(G9=\"\",H9=\"\"), \"Dates de chauffe à renseigner\", SUM(INDEX('DJU Montsouris'!B:B,MATCH(DATE(YEAR(G9),1,1),'DJU Montsouris'!A:A,0),1):INDEX('DJU Montsouris'!B:B,MATCH(G9,'DJU Montsouris'!A:A,0),1),INDEX('DJU Montsouris'!B:B,MATCH(H9,'DJU Montsouris'!A:A,0),1):INDEX('DJU Montsouris'!B:B,MATCH(DATE(YEAR(G9),12,31),'DJU Montsouris'!A:A,0),1)))","v":"Dates de chauffe à renseigner"},{"$error":"#N/A"}]
[null,null,2014,{"$error":"#N/A"},{"$f":"(INDEX($D$5:$D$13,(MIN(IF(ISBLANK($D$5:$D$13),ROW($D$14),ROW($D$5:$D$13))))-ROW($G$4),1))*G42/(INDEX($G$37:$G$45,(MIN(IF(ISBLANK($D$5:$D$13),ROW($D$14),ROW($D$5:$D$13))))-ROW($G$4),1))","v":{"$error":"#REF!"}},"",{"$f":"IF(OR(G10=\"\",H10=\"\"), \"Dates de chauffe à renseigner\", SUM(INDEX('DJU Montsouris'!B:B,MATCH(DATE(YEAR(G10),1,1),'DJU Montsouris'!A:A,0),1):INDEX('DJU Montsouris'!B:B,MATCH(G10,'DJU Montsouris'!A:A,0),1),INDEX('DJU Montsouris'!B:B,MATCH(H10,'DJU Montsouris'!A:A,0),1):INDEX('DJU Montsouris'!B:B,MATCH(DATE(YEAR(G10),12,31),'DJU Montsouris'!A:A,0),1)))","v":"Dates de chauffe à renseigner"},{"$error":"#N/A"}]
[null,null,2015,{"$error":"#N/A"},{"$f":"(INDEX($D$5:$D$13,(MIN(IF(ISBLANK($D$5:$D$13),ROW($D$14),ROW($D$5:$D$13))))-ROW($G$4),1))*G43/(INDEX($G$37:$G$45,(MIN(IF(ISBLANK($D$5:$D$13),ROW($D$14),ROW($D$5:$D$13))))-ROW($G$4),1))","v":{"$error":"#REF!"}},"",{"$f":"IF(OR(G11=\"\",H11=\"\"), \"Dates de chauffe à renseigner\", SUM(INDEX('DJU Montsouris'!B:B,MATCH(DATE(YEAR(G11),1,1),'DJU Montsouris'!A:A,0),1):INDEX('DJU Montsouris'!B:B,MATCH(G11,'DJU Montsouris'!A:A,0),1),INDEX('DJU Montsouris'!B:B,MATCH(H11,'DJU Montsouris'!A:A,0),1):INDEX('DJU Montsouris'!B:B,MATCH(DATE(YEAR(G11),12,31),'DJU Montsouris'!A:A,0),1)))","v":"Dates de chauffe à renseigner"},{"$error":"#N/A"}]
[null,null,2016,{"$error":"#N/A"},{"$f":"(INDEX($D$5:$D$13,(MIN(IF(ISBLANK($D$5:$D$13),ROW($D$14),ROW($D$5:$D$13))))-ROW($G$4),1))*G44/(INDEX($G$37:$G$45,(MIN(IF(ISBLANK($D$5:$D$13),ROW($D$14),ROW($D$5:$D$13))))-ROW($G$4),1))","v":{"$error":"#REF!"}},"",{"$f":"IF(OR(G12=\"\",H12=\"\"), \"Dates de chauffe à renseigner\", SUM(INDEX('DJU Montsouris'!B:B,MATCH(DATE(YEAR(G12),1,1),'DJU Montsouris'!A:A,0),1):INDEX('DJU Montsouris'!B:B,MATCH(G12,'DJU Montsouris'!A:A,0),1),INDEX('DJU Montsouris'!B:B,MATCH(H12,'DJU Montsouris'!A:A,0),1):INDEX('DJU Montsouris'!B:B,MATCH(DATE(YEAR(G12),12,31),'DJU Montsouris'!A:A,0),1)))","v":"Dates de chauffe à renseigner"},{"$error":"#N/A"}]
[null,null,0,{"$error":"#N/A"},{"$f":"(INDEX($D$5:$D$13,(MIN(IF(ISBLANK($D$5:$D$13),ROW($D$14),ROW($D$5:$D$13))))-ROW($G$4),1))*G45/(INDEX($G$37:$G$45,(MIN(IF(ISBLANK($D$5:$D$13),ROW($D$14),ROW($D$5:$D$13))))-ROW($G$4),1))","v":{"$error":"#REF!"}},"",{"$f":"IF(OR(G13=\"\",H13=\"\"), \"Dates de chauffe à renseigner\", SUM(INDEX('DJU Montsouris'!B:B,MATCH(DATE(YEAR(G13),1,1),'DJU Montsouris'!A:A,0),1):INDEX('DJU Montsouris'!B:B,MATCH(G13,'DJU Montsouris'!A:A,0),1),INDEX('DJU Montsouris'!B:B,MATCH(H13,'DJU Montsouris'!A:A,0),1):INDEX('DJU Montsouris'!B:B,MATCH(DATE(YEAR(G13),12,31),'DJU Montsouris'!A:A,0),1)))","v":"Dates de chauffe à renseigner"},{"$error":"#N/A"}]
[]
[null,null,null,null,"Moyenne :",{"$f":"AVERAGE(F37:F45)","v":{"$error":"#DIV/0!"}}]
[]
[]
[]
[]
[]
[]
[]
[]
[]
[]
[]
[]
[]
[]
[]
[]
[]
[]
[]
[]
[]
[]
[]
[]
[]
[]
[]
[]
[]
[]
[]
[]
[]
[]
[]
[]
[]
[]
[]
[]
[]
[]
[]
[]
[]
[]
[]
[]
[]
[]
[]
[]
[]
[]
[null,null,null,null,"Analyse des consommations de chauffage et d'ECS (Gaz)"]
[null,null,{"$f":"IF(Accueil!A3=1,\"\",\"Attention, vous avez spécifié sur la page Accueil être en chauffage collectif SANS eau chaude sanitaire\")","v":""}]
[null,"Année","Consommation totale (kWh)","Consommation d'ECS (m3)","Facture (€ TTC)","Surface habitable chauffée (m2)","Période de chauffe"]
[null,null,null,null,null,null,"Fermeture","Ouverture"]
[null,2009,null,null,null,null,null,null,{"$f":"IF(OR(AND(G106=\"\",H106<>\"\"),AND(G106<>\"\",H106=\"\")),\"Veuillez remplir les deux dates\",IF(AND(G106=\"\",H106=\"\"),\"\",IF(AND((YEAR(G106))=B106,(YEAR(H106))=B106),\"\",CONCATENATE(\"Attention, les dates de la 'période de chauffe' ne correspondent pas à \",B106) )))","v":""}]
[null,2010,null,null,null,null,null,null,{"$f":"IF(OR(AND(G107=\"\",H107<>\"\"),AND(G107<>\"\",H107=\"\")),\"Veuillez remplir les deux dates\",IF(AND(G107=\"\",H107=\"\"),\"\",IF(AND((YEAR(G107))=B107,(YEAR(H107))=B107),\"\",CONCATENATE(\"Attention, les dates de la 'période de chauffe' ne correspondent pas à \",B107) )))","v":""}]
[null,2011,null,null,null,null,null,null,""]
[null,2012,null,null,null,null,null,null,""]
[null,2013,null,null,null,null,null,null,""]
[null,2014,null,null,null,null,null,null,""]
[null,2015,null,null,null,null,null,null,""]
[null,2016,null,null,null,null,null,null,""]
[null,null,null,null,null,null,null,null,""]
[]
[]
[]
[]
[]
[]
[]
[]
[]
[]
[]
[]
[]
[]
[]
[]
[]
[]
[]
[]
[]
[]
[]
[]
[]
[null,null,"Nombre de DJU","Consommation chauffage par DJU","Simulation consommation chauffage sans dérive (kWh)","Consommation d'énergie ECS (kWh)","Consommation chauffage (kWh)","Consommation chauffage + ECS (kWh/m2)","Consommation chauffage (kWh/m2)","Evolution prix du kWh (c€/kWh)"]
[null,null,{"$f":"IF(OR(G106=\"\",H106=\"\"), \"Dates de chauffe à renseigner\", SUM(INDEX('DJU Montsouris'!B:B,MATCH(DATE(YEAR(G106),1,1),'DJU Montsouris'!A:A,0),1):INDEX('DJU Montsouris'!B:B,MATCH(G106,'DJU Montsouris'!A:A,0),1),INDEX('DJU Montsouris'!B:B,MATCH(H106,'DJU Montsouris'!A:A,0),1):INDEX('DJU Montsouris'!B:B,MATCH(DATE(YEAR(G106),12,31),'DJU Montsouris'!A:A,0),1)))","v":"Dates de chauffe à renseigner"},{"$f":"IF(G141=0,#N/A,G141/C141)","v":{"$error":"#N/A"}},{"$f":"(INDEX($G$141:$G$149,(MIN(IF(ISERROR($G$141:$G$149),ROW($C$150),ROW($G$141:$G$149))))-ROW($C$140),1))*C141/(INDEX($C$141:$C$149,(MIN(IF(ISERROR($G$141:$G$149),ROW($C$150),ROW($G$141:$G$149))))-ROW($C$140),1))","v":{"$error":"#REF!"}},{"$f":"120*D106","v":0},{"$f":"IF(C106=\"\",#N/A,C106-F141)","v":{"$error":"#N/A"}},{"$f":"IF(C106=\"\",\"\",C106/F106)","v":""},{"$f":"IF(ISNA(G141),\"\",G141/F106)","v":""},{"$f":"IF(AND(E106<>\"\",C106<>\"\"),E106/C106*100,#N/A)","v":{"$error":"#N/A"}}]
[null,null,{"$f":"IF(OR(G107=\"\",H107=\"\"), \"Dates de chauffe à renseigner\", SUM(INDEX('DJU Montsouris'!B:B,MATCH(DATE(YEAR(G107),1,1),'DJU Montsouris'!A:A,0),1):INDEX('DJU Montsouris'!B:B,MATCH(G107,'DJU Montsouris'!A:A,0),1),INDEX('DJU Montsouris'!B:B,MATCH(H107,'DJU Montsouris'!A:A,0),1):INDEX('DJU Montsouris'!B:B,MATCH(DATE(YEAR(G107),12,31),'DJU Montsouris'!A:A,0),1)))","v":"Dates de chauffe à renseigner"},{"$f":"IF(G142=0,#N/A,G142/C142)","v":{"$error":"#N/A"}},{"$f":"(INDEX($G$141:$G$149,(MIN(IF(ISERROR($G$141:$G$149),ROW($C$150),ROW($G$141:$G$149))))-ROW($C$140),1))*C142/(INDEX($C$141:$C$149,(MIN(IF(ISERROR($G$141:$G$149),ROW($C$150),ROW($G$141:$G$149))))-ROW($C$140),1))","v":{"$error":"#REF!"}},0,{"$f":"IF(C107=\"\",#N/A, C107-F142)","v":{"$error":"#N/A"}},"","",{"$error":"#N/A"}]
[null,null,{"$f":"IF(OR(G108=\"\",H108=\"\"), \"Dates de chauffe à renseigner\", SUM(INDEX('DJU Montsouris'!B:B,MATCH(DATE(YEAR(G108),1,1),'DJU Montsouris'!A:A,0),1):INDEX('DJU Montsouris'!B:B,MATCH(G108,'DJU Montsouris'!A:A,0),1),INDEX('DJU Montsouris'!B:B,MATCH(H108,'DJU Montsouris'!A:A,0),1):INDEX('DJU Montsouris'!B:B,MATCH(DATE(YEAR(G108),12,31),'DJU Montsouris'!A:A,0),1)))","v":"Dates de chauffe à renseigner"},{"$f":"IF(G143=0,#N/A,G143/C143)","v":{"$error":"#N/A"}},{"$f":"(INDEX($G$141:$G$149,(MIN(IF(ISERROR($G$141:$G$149),ROW($C$150),ROW($G$141:$G$149))))-ROW($C$140),1))*C143/(INDEX($C$141:$C$149,(MIN(IF(ISERROR($G$141:$G$149),ROW($C$150),ROW($G$141:$G$149))))-ROW($C$140),1))","v":{"$error":"#REF!"}},0,{"$error":"#N/A"},"","",{"$error":"#N/A"}]
[null,null,{"$f":"IF(OR(G109=\"\",H109=\"\"), \"Dates de chauffe à renseigner\", SUM(INDEX('DJU Montsouris'!B:B,MATCH(DATE(YEAR(G109),1,1),'DJU Montsouris'!A:A,0),1):INDEX('DJU Montsouris'!B:B,MATCH(G109,'DJU Montsouris'!A:A,0),1),INDEX('DJU Montsouris'!B:B,MATCH(H109,'DJU Montsouris'!A:A,0),1):INDEX('DJU Montsouris'!B:B,MATCH(DATE(YEAR(G109),12,31),'DJU Montsouris'!A:A,0),1)))","v":"Dates de chauffe à renseigner"},{"$error":"#N/A"},{"$f":"(INDEX($G$141:$G$149,(MIN(IF(ISERROR($G$141:$G$149),ROW($C$150),ROW($G$141:$G$149))))-ROW($C$140),1))*C144/(INDEX($C$141:$C$149,(MIN(IF(ISERROR($G$141:$G$149),ROW($C$150),ROW($G$141:$G$149))))-ROW($C$140),1))","v":{"$error":"#REF!"}},0,{"$error":"#N/A"},"","",{"$error":"#N/A"}]
[null,null,{"$f":"IF(OR(G110=\"\",H110=\"\"), \"Dates de chauffe à renseigner\", SUM(INDEX('DJU Montsouris'!B:B,MATCH(DATE(YEAR(G110),1,1),'DJU Montsouris'!A:A,0),1):INDEX('DJU Montsouris'!B:B,MATCH(G110,'DJU Montsouris'!A:A,0),1),INDEX('DJU Montsouris'!B:B,MATCH(H110,'DJU Montsouris'!A:A,0),1):INDEX('DJU Montsouris'!B:B,MATCH(DATE(YEAR(G110),12,31),'DJU Montsouris'!A:A,0),1)))","v":"Dates de chauffe à renseigner"},{"$error":"#N/A"},{"$f":"(INDEX($G$141:$G$149,(MIN(IF(ISERROR($G$141:$G$149),ROW($C$150),ROW($G$141:$G$149))))-ROW($C$140),1))*C145/(INDEX($C$141:$C$149,(MIN(IF(ISERROR($G$141:$G$149),ROW($C$150),ROW($G$141:$G$149))))-ROW($C$140),1))","v":{"$error":"#REF!"}},0,{"$error":"#N/A"},"","",{"$error":"#N/A"}]
[null,null,{"$f":"IF(OR(G111=\"\",H111=\"\"), \"Dates de chauffe à renseigner\", SUM(INDEX('DJU Montsouris'!B:B,MATCH(DATE(YEAR(G111),1,1),'DJU Montsouris'!A:A,0),1):INDEX('DJU Montsouris'!B:B,MATCH(G111,'DJU Montsouris'!A:A,0),1),INDEX('DJU Montsouris'!B:B,MATCH(H111,'DJU Montsouris'!A:A,0),1):INDEX('DJU Montsouris'!B:B,MATCH(DATE(YEAR(G111),12,31),'DJU Montsouris'!A:A,0),1)))","v":"Dates de chauffe à renseigner"},{"$error":"#N/A"},{"$f":"(INDEX($G$141:$G$149,(MIN(IF(ISERROR($G$141:$G$149),ROW($C$150),ROW($G$141:$G$149))))-ROW($C$140),1))*C146/(INDEX($C$141:$C$149,(MIN(IF(ISERROR($G$141:$G$149),ROW($C$150),ROW($G$141:$G$149))))-ROW($C$140),1))","v":{"$error":"#REF!"}},0,{"$error":"#N/A"},"","",{"$error":"#N/A"}]
[null,null,{"$f":"IF(OR(G112=\"\",H112=\"\"), \"Dates de chauffe à renseigner\", SUM(INDEX('DJU Montsouris'!B:B,MATCH(DATE(YEAR(G112),1,1),'DJU Montsouris'!A:A,0),1):INDEX('DJU Montsouris'!B:B,MATCH(G112,'DJU Montsouris'!A:A,0),1),INDEX('DJU Montsouris'!B:B,MATCH(H112,'DJU Montsouris'!A:A,0),1):INDEX('DJU Montsouris'!B:B,MATCH(DATE(YEAR(G112),12,31),'DJU Montsouris'!A:A,0),1)))","v":"Dates de chauffe à renseigner"},{"$error":"#N/A"},{"$f":"(INDEX($G$141:$G$149,(MIN(IF(ISERROR($G$141:$G$149),ROW($C$150),ROW($G$141:$G$149))))-ROW($C$140),1))*C147/(INDEX($C$141:$C$149,(MIN(IF(ISERROR($G$141:$G$149),ROW($C$150),ROW($G$141:$G$149))))-ROW($C$140),1))","v":{"$error":"#REF!"}},0,{"$error":"#N/A"},"","",{"$error":"#N/A"}]
[null,null,{"$f":"IF(OR(G113=\"\",H113=\"\"), \"Dates de chauffe à renseigner\", SUM(INDEX('DJU Montsouris'!B:B,MATCH(DATE(YEAR(G113),1,1),'DJU Montsouris'!A:A,0),1):INDEX('DJU Montsouris'!B:B,MATCH(G113,'DJU Montsouris'!A:A,0),1),INDEX('DJU Montsouris'!B:B,MATCH(H113,'DJU Montsouris'!A:A,0),1):INDEX('DJU Montsouris'!B:B,MATCH(DATE(YEAR(G113),12,31),'DJU Montsouris'!A:A,0),1)))","v":"Dates de chauffe à renseigner"},{"$error":"#N/A"},{"$f":"(INDEX($G$141:$G$149,(MIN(IF(ISERROR($G$141:$G$149),ROW($C$150),ROW($G$141:$G$149))))-ROW($C$140),1))*C148/(INDEX($C$141:$C$149,(MIN(IF(ISERROR($G$141:$G$149),ROW($C$150),ROW($G$141:$G$149))))-ROW($C$140),1))","v":{"$error":"#REF!"}},0,{"$error":"#N/A"},"","",{"$error":"#N/A"}]
[null,null,{"$f":"IF(OR(G114=\"\",H114=\"\"), \"Dates de chauffe à renseigner\", SUM(INDEX('DJU Montsouris'!B:B,MATCH(DATE(YEAR(G114),1,1),'DJU Montsouris'!A:A,0),1):INDEX('DJU Montsouris'!B:B,MATCH(G114,'DJU Montsouris'!A:A,0),1),INDEX('DJU Montsouris'!B:B,MATCH(H114,'DJU Montsouris'!A:A,0),1):INDEX('DJU Montsouris'!B:B,MATCH(DATE(YEAR(G114),12,31),'DJU Montsouris'!A:A,0),1)))","v":"Dates de chauffe à renseigner"},{"$error":"#N/A"},{"$f":"(INDEX($G$141:$G$149,(MIN(IF(ISERROR($G$141:$G$149),ROW($C$150),ROW($G$141:$G$149))))-ROW($C$140),1))*C149/(INDEX($C$141:$C$149,(MIN(IF(ISERROR($G$141:$G$149),ROW($C$150),ROW($G$141:$G$149))))-ROW($C$140),1))","v":{"$error":"#REF!"}},0,{"$error":"#N/A"},"","",{"$error":"#N/A"}]
[]
[null,null,null,null,null,null,"Moyenne :",{"$f":"AVERAGE(H141:H149)","v":{"$error":"#DIV/0!"}},{"$f":"AVERAGE(I141:I149)","v":{"$error":"#DIV/0!"}}]

{"sheet":"Gaz Saison de chauffe","index":2,"n_rows":151,"n_cols":11,"rows_kept":151,"cut":false,"hidden":false,"merged":[[123,3,123,5],[100,5,101,5],[100,7,100,8],[2,2,3,3],[25,3,25,5],[100,3,101,3],[99,3,99,9],[100,6,101,6],[100,4,101,4],[2,5,3,5],[1,3,1,9],[2,4,3,4],[2,6,3,6],[2,7,2,8],[100,1,101,2]]}
[null,null,null,null,null,"Analyse des consommations de chauffage (Gaz)"]
[null,null,null,{"$f":"IF(Accueil!A3=2,\"\",\"Attention, vous avez spécifié sur la page Accueil être en chauffage collectif AVEC eau chaude sanitaire\")","v":"Attention, vous avez spécifié sur la page Accueil être en chauffage collectif AVEC eau chaude sanitaire"}]
[null,null,"Saison de chauffe",null,"Consommation Chauffage (kWh)","Facture Chauffage (€ TTC)","Surface habitable chauffée (m2)","Période de chauffe (jj/mm/aaaa)"]
[null,null,null,null,null,null,null,"Ouverture","Fermeture"]
[null,null,2008,2009,null,null,null,null,null,{"$f":"IF(OR(AND(H5=\"\",I5<>\"\"),AND(H5<>\"\",I5=\"\")), \"Veuillez remplir les deux dates\", IF(AND(H5=\"\",I5=\"\"),\"\",IF(AND((YEAR(H5))=C5,(YEAR(I5))=D5),\"\",\"Attention, les dates 'Saison de chauffe' et 'période de chauffe' sont différentes\")))","v":""}]
[null,null,2009,2010,null,null,null,null,null,{"$f":"IF(OR(AND(H6=\"\",I6<>\"\"),AND(H6<>\"\",I6=\"\")), \"Veuillez remplir les deux dates\", IF(AND(H6=\"\",I6=\"\"),\"\",IF(AND((YEAR(H6))=C6,(YEAR(I6))=D6),\"\",\"Attention, les dates 'Saison de chauffe' et 'période de chauffe' sont différentes\")))","v":""}]
[null,null,2010,2011,null,null,null,null,null,""]
[null,null,2011,2012,null,null,null,null,null,""]
[null,null,2012,2013,null,null,null,null,null,""]
[null,null,2013,2014,null,null,null,null,null,""]
[null,null,2014,2015,null,null,null,null,null,""]
[null,null,2015,2016,null,null,null,null,null,""]
[null,null,null,null,null,null,null,null,null,""]
[]
[]
[]
[]
[]
[]
[]
[]
[]
[]
[]
[]
[]
[]
[]
[]
[]
[]
[]
[]
[]
[]
[null,null,null,"Saison de chauffe","Consommation chauffage par DJU","Simulation consommation chauffage sans dérive (kWh)","Consommation relative (kWh/m2)","Nombre de DJU","Evolution prix du kWh"]
[null,null,null,{"$f":"C5&\"/\"&D5","v":"2008/2009"},{"$f":"IF(E5=\"\",#N/A,E5/H37)","v":{"$error":"#N/A"}},{"$f":"(INDEX($E$5:$E$13,(MIN(IF(ISBLANK($E$5:$E$13),ROW($E$14),ROW($E$5:$E$13))))-ROW($H$4),1))*H37/(INDEX($H$37:$H$45,(MIN(IF(ISBLANK($E$5:$E$13),ROW($E$14),ROW($E$5:$E$13))))-ROW($H$4),1))","v":{"$error":"#REF!"}},{"$f":"IF(E5=\"\",\"\",E5/G5)","v":""},{"$f":"IF(OR(H5=\"\",I5=\"\"), \"Dates de chauffe à renseigner\", SUM(INDEX('DJU Montsouris'!B:B,MATCH(H5,'DJU Montsouris'!A:A,0),1):INDEX('DJU Montsouris'!B:B,MATCH(I5,'DJU Montsouris'!A:A,0),1)))","v":"Dates de chauffe à renseigner"},{"$f":"IF(AND(E5<>\"\",F5<>\"\"),F5/E5*100,#N/A)","v":{"$error":"#N/A"}}]
[null,null,null,{"$f":"C6&\"/\"&D6","v":"2009/2010"},{"$f":"IF(E6=\"\",#N/A,E6/H38)","v":{"$error":"#N/A"}},{"$f":"(INDEX($E$5:$E$13,(MIN(IF(ISBLANK($E$5:$E$13),ROW($E$14),ROW($E$5:$E$13))))-ROW($H$4),1))*H38/(INDEX($H$37:$H$45,(MIN(IF(ISBLANK($E$5:$E$13),ROW($E$14),ROW($E$5:$E$13))))-ROW($H$4),1))","v":{"$error":"#REF!"}},{"$f":"IF(E6=\"\",\"\",E6/G6)","v":""},{"$f":"IF(OR(H6=\"\",I6=\"\"), \"Dates de chauffe à renseigner\", SUM(INDEX('DJU Montsouris'!B:B,MATCH(H6,'DJU Montsouris'!A:A,0),1):INDEX('DJU Montsouris'!B:B,MATCH(I6,'DJU Montsouris'!A:A,0),1)))","v":"Dates de chauffe à renseigner"},{"$error":"#N/A"}]
[null,null,null,"2010/2011",{"$f":"IF(E7=\"\",#N/A,E7/H39)","v":{"$error":"#N/A"}},{"$f":"(INDEX($E$5:$E$13,(MIN(IF(ISBLANK($E$5:$E$13),ROW($E$14),ROW($E$5:$E$13))))-ROW($H$4),1))*H39/(INDEX($H$37:$H$45,(MIN(IF(ISBLANK($E$5:$E$13),ROW($E$14),ROW($E$5:$E$13))))-ROW($H$4),1))","v":{"$error":"#REF!"}},{"$f":"IF(E7=\"\",\"\",E7/G7)","v":""},{"$f":"IF(OR(H7=\"\",I7=\"\"), \"Dates de chauffe à renseigner\", SUM(INDEX('DJU Montsouris'!B:B,MATCH(H7,'DJU Montsouris'!A:A,0),1):INDEX('DJU Montsouris'!B:B,MATCH(I7,'DJU Montsouris'!A:A,0),1)))","v":"Dates de chauffe à renseigner"},{"$error":"#N/A"}]
[null,null,null,"2011/2012",{"$error":"#N/A"},{"$f":"(INDEX($E$5:$E$13,(MIN(IF(ISBLANK($E$5:$E$13),ROW($E$14),ROW($E$5:$E$13))))-ROW($H$4),1))*H40/(INDEX($H$37:$H$45,(MIN(IF(ISBLANK($E$5:$E$13),ROW($E$14),ROW($E$5:$E$13))))-ROW($H$4),1))","v":{"$error":"#REF!"}},"",{"$f":"IF(OR(H8=\"\",I8=\"\"), \"Dates de chauffe à renseigner\", SUM(INDEX('DJU Montsouris'!B:B,MATCH(H8,'DJU Montsouris'!A:A,0),1):INDEX('DJU Montsouris'!B:B,MATCH(I8,'DJU Montsouris'!A:A,0),1)))","v":"Dates de chauffe à renseigner"},{"$error":"#N/A"}]
[null,null,null,"2012/2013",{"$error":"#N/A"},{"$f":"(INDEX($E$5:$E$13,(MIN(IF(ISBLANK($E$5:$E$13),ROW($E$14),ROW($E$5:$E$13))))-ROW($H$4),1))*H41/(INDEX($H$37:$H$45,(MIN(IF(ISBLANK($E$5:$E$13),ROW($E$14),ROW($E$5:$E$13))))-ROW($H$4),1))","v":{"$error":"#REF!"}},"",{"$f":"IF(OR(H9=\"\",I9=\"\"), \"Dates de chauffe à renseigner\", SUM(INDEX('DJU Montsouris'!B:B,MATCH(H9,'DJU Montsouris'!A:A,0),1):INDEX('DJU Montsouris'!B:B,MATCH(I9,'DJU Montsouris'!A:A,0),1)))","v":"Dates de chauffe à renseigner"},{"$error":"#N/A"}]
[null,null,null,"2013/2014",{"$error":"#N/A"},{"$f":"(INDEX($E$5:$E$13,(MIN(IF(ISBLANK($E$5:$E$13),ROW($E$14),ROW($E$5:$E$13))))-ROW($H$4),1))*H42/(INDEX($H$37:$H$45,(MIN(IF(ISBLANK($E$5:$E$13),ROW($E$14),ROW($E$5:$E$13))))-ROW($H$4),1))","v":{"$error":"#REF!"}},"",{"$f":"IF(OR(H10=\"\",I10=\"\"), \"Dates de chauffe à renseigner\", SUM(INDEX('DJU Montsouris'!B:B,MATCH(H10,'DJU Montsouris'!A:A,0),1):INDEX('DJU Montsouris'!B:B,MATCH(I10,'DJU Montsouris'!A:A,0),1)))","v":"Dates de chauffe à renseigner"},{"$error":"#N/A"}]
[null,null,null,"2014/2015",{"$error":"#N/A"},{"$f":"(INDEX($E$5:$E$13,(MIN(IF(ISBLANK($E$5:$E$13),ROW($E$14),ROW($E$5:$E$13))))-ROW($H$4),1))*H43/(INDEX($H$37:$H$45,(MIN(IF(ISBLANK($E$5:$E$13),ROW($E$14),ROW($E$5:$E$13))))-ROW($H$4),1))","v":{"$error":"#REF!"}},"",{"$f":"IF(OR(H11=\"\",I11=\"\"), \"Dates de chauffe à renseigner\", SUM(INDEX('DJU Montsouris'!B:B,MATCH(H11,'DJU Montsouris'!A:A,0),1):INDEX('DJU Montsouris'!B:B,MATCH(I11,'DJU Montsouris'!A:A,0),1)))","v":"Dates de chauffe à renseigner"},{"$error":"#N/A"}]
[null,null,null,"2015/2016",{"$error":"#N/A"},{"$f":"(INDEX($E$5:$E$13,(MIN(IF(ISBLANK($E$5:$E$13),ROW($E$14),ROW($E$5:$E$13))))-ROW($H$4),1))*H44/(INDEX($H$37:$H$45,(MIN(IF(ISBLANK($E$5:$E$13),ROW($E$14),ROW($E$5:$E$13))))-ROW($H$4),1))","v":{"$error":"#REF!"}},"",{"$f":"IF(OR(H12=\"\",I12=\"\"), \"Dates de chauffe à renseigner\", SUM(INDEX('DJU Montsouris'!B:B,MATCH(H12,'DJU Montsouris'!A:A,0),1):INDEX('DJU Montsouris'!B:B,MATCH(I12,'DJU Montsouris'!A:A,0),1)))","v":"Dates de chauffe à renseigner"},{"$error":"#N/A"}]
[null,null,null,"/",{"$error":"#N/A"},{"$f":"(INDEX($E$5:$E$13,(MIN(IF(ISBLANK($E$5:$E$13),ROW($E$14),ROW($E$5:$E$13))))-ROW($H$4),1))*H45/(INDEX($H$37:$H$45,(MIN(IF(ISBLANK($E$5:$E$13),ROW($E$14),ROW($E$5:$E$13))))-ROW($H$4),1))","v":{"$error":"#REF!"}},"",{"$f":"IF(OR(H13=\"\",I13=\"\"), \"Dates de chauffe à renseigner\", SUM(INDEX('DJU Montsouris'!B:B,MATCH(H13,'DJU Montsouris'!A:A,0),1):INDEX('DJU Montsouris'!B:B,MATCH(I13,'DJU Montsouris'!A:A,0),1)))","v":"Dates de chauffe à renseigner"},{"$error":"#N/A"}]
[]
[null,null,null,null,null,"Moyenne : ",{"$f":"AVERAGE(G37:G45)","v":{"$error":"#DIV/0!"}}]
[]
[]
[]
[]
[]
[]
[]
[]
[]
[]
[]
[]
[]
[]
[]
[]
[]
[]
[]
[]
[]
[]
[]
[]
[]
[]
[]
[]
[]
[]
[]
[]
[]
[]
[]
[]
[]
[]
[]
[]
[]
[]
[]
[]
[]
[]
[]
[]
[]
[]
[]
[null,null,null,null,null,"Analyse des consommations de chauffage et d'ECS (Gaz)"]
[null,null,null,{"$f":"IF(Accueil!A3=1,\"\",\"Attention, vous avez spécifié sur la page Accueil être en chauffage collectif SANS eau chaude sanitaire\")","v":""}]
[null,"Saison de chauffe",null,"Consommation totale (kWh)","Consommation d'ECS (m3)","Facture (€ TTC)","Surface habitable chauffée (m2)","Période de chauffe"]
[null,null,null,null,null,null,null,"Ouverture","Fermeture"]
[null,2008,2009,null,null,null,null,null,null,{"$f":"IF(OR(AND(H103=\"\",I103<>\"\"),AND(H103<>\"\",I103=\"\")), \"Veuillez remplir les deux dates\", IF(AND(H103=\"\",I103=\"\"),\"\",IF(AND((YEAR(H103))=B103,(YEAR(I103))=C103),\"\",\"Attention, les dates 'Saison de chauffe' et 'période de chauffe' sont différentes\")))","v":""}]
[null,2009,2010,null,null,null,null,null,null,{"$f":"IF(OR(AND(H104=\"\",I104<>\"\"),AND(H104<>\"\",I104=\"\")), \"Veuillez remplir les deux dates\", IF(AND(H104=\"\",I104=\"\"),\"\",IF(AND((YEAR(H104))=B104,(YEAR(I104))=C104),\"\",\"Attention, les dates 'Saison de chauffe' et 'période de chauffe' sont différentes\")))","v":""}]
[null,2010,2011,null,null,null,null,null,null,""]
[null,2011,2012,null,null,null,null,null,null,""]
[null,2012,2013,null,null,null,null,null,null,""]
[null,2013,2014,null,null,null,null,null,null,""]
[null,2014,2015,null,null,null,null,null,null,""]
[null,2015,2016,null,null,null,null,null,null,""]
[null,null,null,null,null,null,null,null,null,""]
[]
[]
[]
[]
[]
[]
[]
[]
[]
[]
[]
[]
[]
[]
[]
[]
[]
[]
[]
[]
[]
[]
[]
[]
[]
[]
[]
[]
[null,null,"Saison de chauffe","Nombre de DJU","Consommation chauffage par DJU","Simulation consommation chauffage sans dérive (kWh)","Consommation d'énergie ECS (kWh)","Consommation chauffage (kWh)","Consommation chauffage + ECS (kWh/m2)","Consommation chauffage (kWh/m2)","Evolution prix du kWh"]
[null,null,{"$f":"B103&\"/\"&C103","v":"2008/2009"},{"$f":"IF(OR(H103=\"\",I103=\"\"), \"Dates de chauffe à renseigner\", SUM(INDEX('DJU Montsouris'!B:B,MATCH(H103,'DJU Montsouris'!A:A,0),1):INDEX('DJU Montsouris'!B:B,MATCH(I103,'DJU Montsouris'!A:A,0),1)))","v":"Dates de chauffe à renseigner"},{"$f":"IF(H141=0,#N/A,H141/D141)","v":{"$error":"#N/A"}},{"$f":"(INDEX($H$141:$H$149,(MIN(IF(ISERROR($H$141:$H$149),ROW($H$150),ROW($H$141:$H$149))))-ROW($H$140),1))*D141/(INDEX($D$141:$D$149,(MIN(IF(ISERROR($H$141:$H$149),ROW($H$150),ROW($H$141:$H$149))))-ROW($H$140),1))","v":{"$error":"#REF!"}},{"$f":"120*E103","v":0},{"$f":"IF(D103=\"\",#N/A,D103-G141)","v":{"$error":"#N/A"}},{"$f":"IF(D103=\"\",\"\",D103/G103)","v":""},{"$f":"IF(ISNA(H141),\"\",H141/G103)","v":""},{"$f":"IF(AND(F103<>\"\",D103<>\"\"),F103/D103*100,#N/A)","v":{"$error":"#N/A"}}]
[null,null,{"$f":"B104&\"/\"&C104","v":"2009/2010"},{"$f":"IF(OR(H104=\"\",I104=\"\"), \"Dates de chauffe à renseigner\", SUM(INDEX('DJU Montsouris'!B:B,MATCH(H104,'DJU Montsouris'!A:A,0),1):INDEX('DJU Montsouris'!B:B,MATCH(I104,'DJU Montsouris'!A:A,0),1)))","v":"Dates de chauffe à renseigner"},{"$f":"IF(H142=0,#N/A,H142/D142)","v":{"$error":"#N/A"}},{"$f":"(INDEX($H$141:$H$149,(MIN(IF(ISERROR($H$141:$H$149),ROW($H$150),ROW($H$141:$H$149))))-ROW($H$140),1))*D142/(INDEX($D$141:$D$149,(MIN(IF(ISERROR($H$141:$H$149),ROW($H$150),ROW($H$141:$H$149))))-ROW($H$140),1))","v":{"$error":"#REF!"}},0,{"$error":"#N/A"},"","",{"$error":"#N/A"}]
[null,null,"2010/2011",{"$f":"IF(OR(H105=\"\",I105=\"\"), \"Dates de chauffe à renseigner\", SUM(INDEX('DJU Montsouris'!B:B,MATCH(H105,'DJU Montsouris'!A:A,0),1):INDEX('DJU Montsouris'!B:B,MATCH(I105,'DJU Montsouris'!A:A,0),1)))","v":"Dates de chauffe à renseigner"},{"$f":"IF(H143=0,#N/A,H143/D143)","v":{"$error":"#N/A"}},{"$f":"(INDEX($H$141:$H$149,(MIN(IF(ISERROR($H$141:$H$149),ROW($H$150),ROW($H$141:$H$149))))-ROW($H$140),1))*D143/(INDEX($D$141:$D$149,(MIN(IF(ISERROR($H$141:$H$149),ROW($H$150),ROW($H$141:$H$149))))-ROW($H$140),1))","v":{"$error":"#REF!"}},0,{"$error":"#N/A"},"","",{"$error":"#N/A"}]
[null,null,"2011/2012",{"$f":"IF(OR(H106=\"\",I106=\"\"), \"Dates de chauffe à renseigner\", SUM(INDEX('DJU Montsouris'!B:B,MATCH(H106,'DJU Montsouris'!A:A,0),1):INDEX('DJU Montsouris'!B:B,MATCH(I106,'DJU Montsouris'!A:A,0),1)))","v":"Dates de chauffe à renseigner"},{"$error":"#N/A"},{"$f":"(INDEX($H$141:$H$149,(MIN(IF(ISERROR($H$141:$H$149),ROW($H$150),ROW($H$141:$H$149))))-ROW($H$140),1))*D144/(INDEX($D$141:$D$149,(MIN(IF(ISERROR($H$141:$H$149),ROW($H$150),ROW($H$141:$H$149))))-ROW($H$140),1))","v":{"$error":"#REF!"}},0,{"$error":"#N/A"},"","",{"$error":"#N/A"}]
[null,null,"2012/2013",{"$f":"IF(OR(H107=\"\",I107=\"\"), \"Dates de chauffe à renseigner\", SUM(INDEX('DJU Montsouris'!B:B,MATCH(H107,'DJU Montsouris'!A:A,0),1):INDEX('DJU Montsouris'!B:B,MATCH(I107,'DJU Montsouris'!A:A,0),1)))","v":"Dates de chauffe à renseigner"},{"$error":"#N/A"},{"$f":"(INDEX($H$141:$H$149,(MIN(IF(ISERROR($H$141:$H$149),ROW($H$150),ROW($H$141:$H$149))))-ROW($H$140),1))*D145/(INDEX($D$141:$D$149,(MIN(IF(ISERROR($H$141:$H$149),ROW($H$150),ROW($H$141:$H$149))))-ROW($H$140),1))","v":{"$error":"#REF!"}},0,{"$error":"#N/A"},"","",{"$error":"#N/A"}]
[null,null,"2013/2014",{"$f":"IF(OR(H108=\"\",I108=\"\"), \"Dates de chauffe à renseigner\", SUM(INDEX('DJU Montsouris'!B:B,MATCH(H108,'DJU Montsouris'!A:A,0),1):INDEX('DJU Montsouris'!B:B,MATCH(I108,'DJU Montsouris'!A:A,0),1)))","v":"Dates de chauffe à renseigner"},{"$error":"#N/A"},{"$f":"(INDEX($H$141:$H$149,(MIN(IF(ISERROR($H$141:$H$149),ROW($H$150),ROW($H$141:$H$149))))-ROW($H$140),1))*D146/(INDEX($D$141:$D$149,(MIN(IF(ISERROR($H$141:$H$149),ROW($H$150),ROW($H$141:$H$149))))-ROW($H$140),1))","v":{"$error":"#REF!"}},0,{"$error":"#N/A"},"","",{"$error":"#N/A"}]
[null,null,"2014/2015",{"$f":"IF(OR(H109=\"\",I109=\"\"), \"Dates de chauffe à renseigner\", SUM(INDEX('DJU Montsouris'!B:B,MATCH(H109,'DJU Montsouris'!A:A,0),1):INDEX('DJU Montsouris'!B:B,MATCH(I109,'DJU Montsouris'!A:A,0),1)))","v":"Dates de chauffe à renseigner"},{"$error":"#N/A"},{"$f":"(INDEX($H$141:$H$149,(MIN(IF(ISERROR($H$141:$H$149),ROW($H$150),ROW($H$141:$H$149))))-ROW($H$140),1))*D147/(INDEX($D$141:$D$149,(MIN(IF(ISERROR($H$141:$H$149),ROW($H$150),ROW($H$141:$H$149))))-ROW($H$140),1))","v":{"$error":"#REF!"}},0,{"$error":"#N/A"},"","",{"$error":"#N/A"}]
[null,null,"2015/2016",{"$f":"IF(OR(H110=\"\",I110=\"\"), \"Dates de chauffe à renseigner\", SUM(INDEX('DJU Montsouris'!B:B,MATCH(H110,'DJU Montsouris'!A:A,0),1):INDEX('DJU Montsouris'!B:B,MATCH(I110,'DJU Montsouris'!A:A,0),1)))","v":"Dates de chauffe à renseigner"},{"$error":"#N/A"},{"$f":"(INDEX($H$141:$H$149,(MIN(IF(ISERROR($H$141:$H$149),ROW($H$150),ROW($H$141:$H$149))))-ROW($H$140),1))*D148/(INDEX($D$141:$D$149,(MIN(IF(ISERROR($H$141:$H$149),ROW($H$150),ROW($H$141:$H$149))))-ROW($H$140),1))","v":{"$error":"#REF!"}},0,{"$error":"#N/A"},"","",{"$error":"#N/A"}]
[null,null,"/",{"$f":"IF(OR(H111=\"\",I111=\"\"), \"Dates de chauffe à renseigner\", SUM(INDEX('DJU Montsouris'!B:B,MATCH(H111,'DJU Montsouris'!A:A,0),1):INDEX('DJU Montsouris'!B:B,MATCH(I111,'DJU Montsouris'!A:A,0),1)))","v":"Dates de chauffe à renseigner"},{"$error":"#N/A"},{"$f":"(INDEX($H$141:$H$149,(MIN(IF(ISERROR($H$141:$H$149),ROW($H$150),ROW($H$141:$H$149))))-ROW($H$140),1))*D149/(INDEX($D$141:$D$149,(MIN(IF(ISERROR($H$141:$H$149),ROW($H$150),ROW($H$141:$H$149))))-ROW($H$140),1))","v":{"$error":"#REF!"}},0,{"$error":"#N/A"},"","",{"$error":"#N/A"}]
[]
[null,null,null,null,null,null,null,"Moyenne :",{"$f":"AVERAGE(I141:I149)","v":{"$error":"#DIV/0!"}},{"$f":"AVERAGE(J141:J149)","v":{"$error":"#DIV/0!"}}]

{"sheet":"Fioul Année","index":3,"n_rows":156,"n_cols":12,"rows_kept":156,"cut":false,"hidden":false,"merged":[[1,3,1,10],[101,1,102,1],[101,3,102,3],[2,3,3,3],[2,2,3,2],[2,6,3,6],[2,7,3,7],[2,8,2,9],[51,6,51,15],[124,6,124,8],[101,2,102,2],[101,5,102,5],[101,6,102,6],[2,4,3,4],[2,5,3,5],[101,7,102,7],[101,8,101,9],[101,4,102,4],[25,2,25,7],[100,3,100,10]]}
[null,null,null,null,null,"Analyse des consommations de chauffage (Fioul)"]
[null,null,null,{"$f":"IF(Accueil!A3=2,\"\",\"Attention, vous avez spécifié sur la page Accueil être en chauffage collectif AVEC eau chaude sanitaire\")","v":"Attention, vous avez spécifié sur la page Accueil être en chauffage collectif AVEC eau chaude sanitaire"}]
[null,null,"Année","Quantité en début de saison (litres)","Livraisons (litres)","Quantité en fin de saison (litres)","Facture Chauffage (€ TTC)","Surface habitable chauffée (m2)","Période de chauffe (jj/mm/aaaa)"]
[null,null,null,null,null,null,null,null,"Fermeture","Ouverture"]
[null,null,2009,null,null,null,null,null,null,null,{"$f":"IF(OR(AND(I5=\"\",J5<>\"\"),AND(I5<>\"\",J5=\"\")),\"Veuillez remplir les deux dates\",IF(AND(I5=\"\",J5=\"\"),\"\",IF(AND((YEAR(I5))=C5,(YEAR(J5))=C5),\"\",CONCATENATE(\"Attention, les dates de la 'période de chauffe' ne correspondent pas à \",C5) )))","v":""}]
[null,null,2010,null,null,null,null,null,null,null,""]
[null,null,2011,null,null,null,null,null,null,null,""]
[null,null,2012,null,null,null,null,null,null,null,""]
[null,null,2013,null,null,null,null,null,null,null,""]
[null,null,2014,null,null,null,null,null,null,null,""]
[null,null,2015,null,null,null,null,null,null,null,""]
[null,null,2016,null,null,null,null,null,null,null,""]
[null,null,null,null,null,null,null,null,null,null,""]
[]
[]
[]
[]
[]
[]
[]
[]
[]
[]
[]
[]
[]
[]
[]
[]
[]
[]
[]
[]
[]
[]
[null,null,null,"Année","Consommation totale (litres)","Consommation Chauffage (kWh PCI)","Consommation chauffage par DJU","Simulation consommation chauffage sans dérive (kWh)","Consommation relative (kWh/m2)","Nombre de DJU","Evolution prix du kWh"]
[null,null,null,{"$f":"C5","v":2009},{"$f":"D5+E5-F5","v":0},{"$f":"E37*9.97","v":0},{"$f":"IF(E5<>\"\",F37/J37,#N/A)","v":{"$error":"#N/A"}},{"$f":"(INDEX($F$37:$F$45,(MIN(IF(ISBLANK($E$5:$E$13),ROW($E$14),ROW($E$5:$E$13))))-ROW($I$4),1))*J37/(INDEX($J$37:$J$45,(MIN(IF(ISBLANK($E$5:$E$13),ROW($E$14),ROW($E$5:$E$13))))-ROW($I$4),1))","v":{"$error":"#REF!"}},{"$f":"IF(F37=0,\"\",F37/H5)","v":""},{"$f":"IF(OR(I5=\"\",J5=\"\"), \"Dates de chauffe à renseigner\", SUM(INDEX('DJU Montsouris'!B:B,MATCH(DATE(YEAR(I5),1,1),'DJU Montsouris'!A:A,0),1):INDEX('DJU Montsouris'!B:B,MATCH(I5,'DJU Montsouris'!A:A,0),1),INDEX('DJU Montsouris'!B:B,MATCH(J5,'DJU Montsouris'!A:A,0),1):INDEX('DJU Montsouris'!B:B,MATCH(DATE(YEAR(I5),12,31),'DJU Montsouris'!A:A,0),1)))","v":"Dates de chauffe à renseigner"},{"$f":"IF(AND(G5<>\"\",F37<>0),G5/F37*100,#N/A)","v":{"$error":"#N/A"}}]
[null,null,null,2010,{"$f":"D6+E6-F6","v":0},{"$f":"E38*9.97","v":0},{"$f":"IF(E6<>\"\",F38/J38,#N/A)","v":{"$error":"#N/A"}},{"$f":"(INDEX($F$37:$F$45,(MIN(IF(ISBLANK($E$5:$E$13),ROW($E$14),ROW($E$5:$E$13))))-ROW($I$4),1))*J38/(INDEX($J$37:$J$45,(MIN(IF(ISBLANK($E$5:$E$13),ROW($E$14),ROW($E$5:$E$13))))-ROW($I$4),1))","v":{"$error":"#REF!"}},{"$f":"IF(F38=0,\"\",F38/H6)","v":""},{"$f":"IF(OR(I6=\"\",J6=\"\"), \"Dates de chauffe à renseigner\", SUM(INDEX('DJU Montsouris'!B:B,MATCH(DATE(YEAR(I6),1,1),'DJU Montsouris'!A:A,0),1):INDEX('DJU Montsouris'!B:B,MATCH(I6,'DJU Montsouris'!A:A,0),1),INDEX('DJU Montsouris'!B:B,MATCH(J6,'DJU Montsouris'!A:A,0),1):INDEX('DJU Montsouris'!B:B,MATCH(DATE(YEAR(I6),12,31),'DJU Montsouris'!A:A,0),1)))","v":"Dates de chauffe à renseigner"},{"$f":"IF(AND(G6<>\"\",F38<>0),G6/F38*100,#N/A)","v":{"$error":"#N/A"}}]
[null,null,null,2011,0,0,{"$f":"IF(E7<>\"\",F39/J39,#N/A)","v":{"$error":"#N/A"}},{"$f":"(INDEX($F$37:$F$45,(MIN(IF(ISBLANK($E$5:$E$13),ROW($E$14),ROW($E$5:$E$13))))-ROW($I$4),1))*J39/(INDEX($J$37:$J$45,(MIN(IF(ISBLANK($E$5:$E$13),ROW($E$14),ROW($E$5:$E$13))))-ROW($I$4),1))","v":{"$error":"#REF!"}},{"$f":"IF(F39=0,\"\",F39/H7)","v":""},{"$f":"IF(OR(I7=\"\",J7=\"\"), \"Dates de chauffe à renseigner\", SUM(INDEX('DJU Montsouris'!B:B,MATCH(DATE(YEAR(I7),1,1),'DJU Montsouris'!A:A,0),1):INDEX('DJU Montsouris'!B:B,MATCH(I7,'DJU Montsouris'!A:A,0),1),INDEX('DJU Montsouris'!B:B,MATCH(J7,'DJU Montsouris'!A:A,0),1):INDEX('DJU Montsouris'!B:B,MATCH(DATE(YEAR(I7),12,31),'DJU Montsouris'!A:A,0),1)))","v":"Dates de chauffe à renseigner"},{"$f":"IF(AND(G7<>\"\",F39<>0),G7/F39*100,#N/A)","v":{"$error":"#N/A"}}]
[null,null,null,2012,0,0,{"$error":"#N/A"},{"$f":"(INDEX($F$37:$F$45,(MIN(IF(ISBLANK($E$5:$E$13),ROW($E$14),ROW($E$5:$E$13))))-ROW($I$4),1))*J40/(INDEX($J$37:$J$45,(MIN(IF(ISBLANK($E$5:$E$13),ROW($E$14),ROW($E$5:$E$13))))-ROW($I$4),1))","v":{"$error":"#REF!"}},"",{"$f":"IF(OR(I8=\"\",J8=\"\"), \"Dates de chauffe à renseigner\", SUM(INDEX('DJU Montsouris'!B:B,MATCH(DATE(YEAR(I8),1,1),'DJU Montsouris'!A:A,0),1):INDEX('DJU Montsouris'!B:B,MATCH(I8,'DJU Montsouris'!A:A,0),1),INDEX('DJU Montsouris'!B:B,MATCH(J8,'DJU Montsouris'!A:A,0),1):INDEX('DJU Montsouris'!B:B,MATCH(DATE(YEAR(I8),12,31),'DJU Montsouris'!A:A,0),1)))","v":"Dates de chauffe à renseigner"},{"$error":"#N/A"}]
[null,null,null,2013,0,0,{"$error":"#N/A"},{"$f":"(INDEX($F$37:$F$45,(MIN(IF(ISBLANK($E$5:$E$13),ROW($E$14),ROW($E$5:$E$13))))-ROW($I$4),1))*J41/(INDEX($J$37:$J$45,(MIN(IF(ISBLANK($E$5:$E$13),ROW($E$14),ROW($E$5:$E$13))))-ROW($I$4),1))","v":{"$error":"#REF!"}},"",{"$f":"IF(OR(I9=\"\",J9=\"\"), \"Dates de chauffe à renseigner\", SUM(INDEX('DJU Montsouris'!B:B,MATCH(DATE(YEAR(I9),1,1),'DJU Montsouris'!A:A,0),1):INDEX('DJU Montsouris'!B:B,MATCH(I9,'DJU Montsouris'!A:A,0),1),INDEX('DJU Montsouris'!B:B,MATCH(J9,'DJU Montsouris'!A:A,0),1):INDEX('DJU Montsouris'!B:B,MATCH(DATE(YEAR(I9),12,31),'DJU Montsouris'!A:A,0),1)))","v":"Dates de chauffe à renseigner"},{"$error":"#N/A"}]
[null,null,null,2014,0,0,{"$error":"#N/A"},{"$f":"(INDEX($F$37:$F$45,(MIN(IF(ISBLANK($E$5:$E$13),ROW($E$14),ROW($E$5:$E$13))))-ROW($I$4),1))*J42/(INDEX($J$37:$J$45,(MIN(IF(ISBLANK($E$5:$E$13),ROW($E$14),ROW($E$5:$E$13))))-ROW($I$4),1))","v":{"$error":"#REF!"}},"",{"$f":"IF(OR(I10=\"\",J10=\"\"), \"Dates de chauffe à renseigner\", SUM(INDEX('DJU Montsouris'!B:B,MATCH(DATE(YEAR(I10),1,1),'DJU Montsouris'!A:A,0),1):INDEX('DJU Montsouris'!B:B,MATCH(I10,'DJU Montsouris'!A:A,0),1),INDEX('DJU Montsouris'!B:B,MATCH(J10,'DJU Montsouris'!A:A,0),1):INDEX('DJU Montsouris'!B:B,MATCH(DATE(YEAR(I10),12,31),'DJU Montsouris'!A:A,0),1)))","v":"Dates de chauffe à renseigner"},{"$error":"#N/A"}]
[null,null,null,2015,0,0,{"$error":"#N/A"},{"$f":"(INDEX($F$37:$F$45,(MIN(IF(ISBLANK($E$5:$E$13),ROW($E$14),ROW($E$5:$E$13))))-ROW($I$4),1))*J43/(INDEX($J$37:$J$45,(MIN(IF(ISBLANK($E$5:$E$13),ROW($E$14),ROW($E$5:$E$13))))-ROW($I$4),1))","v":{"$error":"#REF!"}},"",{"$f":"IF(OR(I11=\"\",J11=\"\"), \"Dates de chauffe à renseigner\", SUM(INDEX('DJU Montsouris'!B:B,MATCH(DATE(YEAR(I11),1,1),'DJU Montsouris'!A:A,0),1):INDEX('DJU Montsouris'!B:B,MATCH(I11,'DJU Montsouris'!A:A,0),1),INDEX('DJU Montsouris'!B:B,MATCH(J11,'DJU Montsouris'!A:A,0),1):INDEX('DJU Montsouris'!B:B,MATCH(DATE(YEAR(I11),12,31),'DJU Montsouris'!A:A,0),1)))","v":"Dates de chauffe à renseigner"},{"$error":"#N/A"}]
[null,null,null,2016,0,0,{"$error":"#N/A"},{"$f":"(INDEX($F$37:$F$45,(MIN(IF(ISBLANK($E$5:$E$13),ROW($E$14),ROW($E$5:$E$13))))-ROW($I$4),1))*J44/(INDEX($J$37:$J$45,(MIN(IF(ISBLANK($E$5:$E$13),ROW($E$14),ROW($E$5:$E$13))))-ROW($I$4),1))","v":{"$error":"#REF!"}},"",{"$f":"IF(OR(I12=\"\",J12=\"\"), \"Dates de chauffe à renseigner\", SUM(INDEX('DJU Montsouris'!B:B,MATCH(DATE(YEAR(I12),1,1),'DJU Montsouris'!A:A,0),1):INDEX('DJU Montsouris'!B:B,MATCH(I12,'DJU Montsouris'!A:A,0),1),INDEX('DJU Montsouris'!B:B,MATCH(J12,'DJU Montsouris'!A:A,0),1):INDEX('DJU Montsouris'!B:B,MATCH(DATE(YEAR(I12),12,31),'DJU Montsouris'!A:A,0),1)))","v":"Dates de chauffe à renseigner"},{"$error":"#N/A"}]
[null,null,null,0,0,0,{"$error":"#N/A"},{"$f":"(INDEX($F$37:$F$45,(MIN(IF(ISBLANK($E$5:$E$13),ROW($E$14),ROW($E$5:$E$13))))-ROW($I$4),1))*J45/(INDEX($J$37:$J$45,(MIN(IF(ISBLANK($E$5:$E$13),ROW($E$14),ROW($E$5:$E$13))))-ROW($I$4),1))","v":{"$error":"#REF!"}},"",{"$f":"IF(OR(I13=\"\",J13=\"\"), \"Dates de chauffe à renseigner\", SUM(INDEX('DJU Montsouris'!B:B,MATCH(DATE(YEAR(I13),1,1),'DJU Montsouris'!A:A,0),1):INDEX('DJU Montsouris'!B:B,MATCH(I13,'DJU Montsouris'!A:A,0),1),INDEX('DJU Montsouris'!B:B,MATCH(J13,'DJU Montsouris'!A:A,0),1):INDEX('DJU Montsouris'!B:B,MATCH(DATE(YEAR(I13),12,31),'DJU Montsouris'!A:A,0),1)))","v":"Dates de chauffe à renseigner"},{"$error":"#N/A"}]
[]
[null,null,null,null,null,null,null,"Moyenne :",{"$f":"AVERAGE(I37:I45)","v":{"$error":"#DIV/0!"}}]
[]
[]
[]
[]
[]
[]
[]
[]
[]
[]
[]
[]
[]
[]
[]
[]
[]
[]
[]
[]
[]
[]
[]
[]
[]
[]
[]
[]
[]
[]
[]
[]
[]
[]
[]
[]
[]
[]
[]
[]
[]
[]
[]
[]
[]
[]
[]
[]
[]
[]
[]
[]
[null,null,null,null,null,"Analyse des consommations de chauffage et d'ECS (Fioul)"]
[null,null,null,{"$f":"IF(Accueil!A3=1,\"\",\"Attention, vous avez spécifié sur la page Accueil être en chauffage collectif SANS eau chaude sanitaire\")","v":""}]
[null,"Année","Quantité en début de saison (litres)","Livraison (litres)","Quantité en fin de saison (litres)","Consommation d'ECS (m3)","Facture (€ TTC)","Surface habitable chauffée (m2)","Période de chauffe"]
[null,null,null,null,null,null,null,null,"Fermeture","Ouverture"]
[null,2009,null,null,null,null,null,null,null,null,{"$f":"IF(OR(AND(I104=\"\",J104<>\"\"),AND(I104<>\"\",J104=\"\")),\"Veuillez remplir les deux dates\",IF(AND(I104=\"\",J104=\"\"),\"\",IF(AND((YEAR(I104))=B104,(YEAR(J104))=B104),\"\",CONCATENATE(\"Attention, les dates de la 'période de chauffe' ne correspondent pas à \",B104) )))","v":""}]
[null,2010,null,null,null,null,null,null,null,null,{"$f":"IF(OR(AND(I105=\"\",J105<>\"\"),AND(I105<>\"\",J105=\"\")),\"Veuillez remplir les deux dates\",IF(AND(I105=\"\",J105=\"\"),\"\",IF(AND((YEAR(I105))=B105,(YEAR(J105))=B105),\"\",CONCATENATE(\"Attention, les dates de la 'période de chauffe' ne correspondent pas à \",B105) )))","v":""}]
[null,2011,null,null,null,null,null,null,null,null,""]
[null,2012,null,null,null,null,null,null,null,null,""]
[null,2013,null,null,null,null,null,null,null,null,""]
[null,2014,null,null,null,null,null,null,null,null,""]
[null,2015,null,null,null,null,null,null,null,null,""]
[null,2016,null,null,null,null,null,null,null,null,""]
[null,null,null,null,null,null,null,null,null,null,""]
[]
[]
[]
[]
[]
[]
[]
[]
[]
[]
[]
[]
[]
[]
[]
[]
[]
[]
[]
[]
[]
[]
[]
[]
[]
[]
[]
[]
[]
[]
[]
[]
[null,null,"Consommation totale (litres)","Consommation totale (kWh)","Nombre de DJU","Consommation chauffage par DJU","Simulation consommation chauffage sans dérive (kWh)","Consommation d'énergie ECS (kWh)","Consommation chauffage (kWh)","Consommation chauffage + ECS (kWh/m2)","Consommation chauffage (kWh/m2)","Evolution prix du kWh"]
[null,null,{"$f":"C104+D104-E104","v":0},{"$f":"C146*9.97","v":0},{"$f":"IF(OR(I104=\"\",J104=\"\"), \"Dates de chauffe à renseigner\", SUM(INDEX('DJU Montsouris'!B:B,MATCH(DATE(YEAR(I104),1,1),'DJU Montsouris'!A:A,0),1):INDEX('DJU Montsouris'!B:B,MATCH(I104,'DJU Montsouris'!A:A,0),1),INDEX('DJU Montsouris'!B:B,MATCH(J104,'DJU Montsouris'!A:A,0),1):INDEX('DJU Montsouris'!B:B,MATCH(DATE(YEAR(I104),12,31),'DJU Montsouris'!A:A,0),1)))","v":"Dates de chauffe à renseigner"},{"$f":"IF(I146=0,#N/A,I146/E146)","v":{"$error":"#N/A"}},{"$f":"(INDEX($I$146:$I$154,(MIN(IF(ISBLANK($D$104:$D$112),ROW($D$113),ROW($D$104:$D$112))))-ROW($I$103),1))*E146/(INDEX($E$146:$E$154,(MIN(IF(ISBLANK($D$104:$D$112),ROW($D$113),ROW($D$104:$D$112))))-ROW($I$103),1))","v":{"$error":"#REF!"}},{"$f":"120*F104","v":0},{"$f":"D146-H146","v":0},{"$f":"IF(D146=0,\"\",D146/H104)","v":""},{"$f":"IF(I146=0,\"\",I146/H104)","v":""},{"$f":"IF(AND(G104<>\"\",D146<>0),G104/D146*100,#N/A)","v":{"$error":"#N/A"}}]
[null,null,0,{"$f":"C147*9.97","v":0},{"$f":"IF(OR(I105=\"\",J105=\"\"), \"Dates de chauffe à renseigner\", SUM(INDEX('DJU Montsouris'!B:B,MATCH(DATE(YEAR(I105),1,1),'DJU Montsouris'!A:A,0),1):INDEX('DJU Montsouris'!B:B,MATCH(I105,'DJU Montsouris'!A:A,0),1),INDEX('DJU Montsouris'!B:B,MATCH(J105,'DJU Montsouris'!A:A,0),1):INDEX('DJU Montsouris'!B:B,MATCH(DATE(YEAR(I105),12,31),'DJU Montsouris'!A:A,0),1)))","v":"Dates de chauffe à renseigner"},{"$f":"IF(I147=0,#N/A,I147/E147)","v":{"$error":"#N/A"}},{"$f":"(INDEX($I$146:$I$154,(MIN(IF(ISBLANK($D$104:$D$112),ROW($D$113),ROW($D$104:$D$112))))-ROW($I$103),1))*E147/(INDEX($E$146:$E$154,(MIN(IF(ISBLANK($D$104:$D$112),ROW($D$113),ROW($D$104:$D$112))))-ROW($I$103),1))","v":{"$error":"#REF!"}},0,{"$f":"D147-H147","v":0},"","",{"$error":"#N/A"}]
[null,null,0,0,{"$f":"IF(OR(I106=\"\",J106=\"\"), \"Dates de chauffe à renseigner\", SUM(INDEX('DJU Montsouris'!B:B,MATCH(DATE(YEAR(I106),1,1),'DJU Montsouris'!A:A,0),1):INDEX('DJU Montsouris'!B:B,MATCH(I106,'DJU Montsouris'!A:A,0),1),INDEX('DJU Montsouris'!B:B,MATCH(J106,'DJU Montsouris'!A:A,0),1):INDEX('DJU Montsouris'!B:B,MATCH(DATE(YEAR(I106),12,31),'DJU Montsouris'!A:A,0),1)))","v":"Dates de chauffe à renseigner"},{"$f":"IF(I148=0,#N/A,I148/E148)","v":{"$error":"#N/A"}},{"$f":"(INDEX($I$146:$I$154,(MIN(IF(ISBLANK($D$104:$D$112),ROW($D$113),ROW($D$104:$D$112))))-ROW($I$103),1))*E148/(INDEX($E$146:$E$154,(MIN(IF(ISBLANK($D$104:$D$112),ROW($D$113),ROW($D$104:$D$112))))-ROW($I$103),1))","v":{"$error":"#REF!"}},0,0,"","",{"$error":"#N/A"}]
[null,null,0,0,{"$f":"IF(OR(I107=\"\",J107=\"\"), \"Dates de chauffe à renseigner\", SUM(INDEX('DJU Montsouris'!B:B,MATCH(DATE(YEAR(I107),1,1),'DJU Montsouris'!A:A,0),1):INDEX('DJU Montsouris'!B:B,MATCH(I107,'DJU Montsouris'!A:A,0),1),INDEX('DJU Montsouris'!B:B,MATCH(J107,'DJU Montsouris'!A:A,0),1):INDEX('DJU Montsouris'!B:B,MATCH(DATE(YEAR(I107),12,31),'DJU Montsouris'!A:A,0),1)))","v":"Dates de chauffe à renseigner"},{"$error":"#N/A"},{"$f":"(INDEX($I$146:$I$154,(MIN(IF(ISBLANK($D$104:$D$112),ROW($D$113),ROW($D$104:$D$112))))-ROW($I$103),1))*E149/(INDEX($E$146:$E$154,(MIN(IF(ISBLANK($D$104:$D$112),ROW($D$113),ROW($D$104:$D$112))))-ROW($I$103),1))","v":{"$error":"#REF!"}},0,0,"","",{"$error":"#N/A"}]
[null,null,0,0,{"$f":"IF(OR(I108=\"\",J108=\"\"), \"Dates de chauffe à renseigner\", SUM(INDEX('DJU Montsouris'!B:B,MATCH(DATE(YEAR(I108),1,1),'DJU Montsouris'!A:A,0),1):INDEX('DJU Montsouris'!B:B,MATCH(I108,'DJU Montsouris'!A:A,0),1),INDEX('DJU Montsouris'!B:B,MATCH(J108,'DJU Montsouris'!A:A,0),1):INDEX('DJU Montsouris'!B:B,MATCH(DATE(YEAR(I108),12,31),'DJU Montsouris'!A:A,0),1)))","v":"Dates de chauffe à renseigner"},{"$error":"#N/A"},{"$f":"(INDEX($I$146:$I$154,(MIN(IF(ISBLANK($D$104:$D$112),ROW($D$113),ROW($D$104:$D$112))))-ROW($I$103),1))*E150/(INDEX($E$146:$E$154,(MIN(IF(ISBLANK($D$104:$D$112),ROW($D$113),ROW($D$104:$D$112))))-ROW($I$103),1))","v":{"$error":"#REF!"}},0,0,"","",{"$error":"#N/A"}]
[null,null,0,0,{"$f":"IF(OR(I109=\"\",J109=\"\"), \"Dates de chauffe à renseigner\", SUM(INDEX('DJU Montsouris'!B:B,MATCH(DATE(YEAR(I109),1,1),'DJU Montsouris'!A:A,0),1):INDEX('DJU Montsouris'!B:B,MATCH(I109,'DJU Montsouris'!A:A,0),1),INDEX('DJU Montsouris'!B:B,MATCH(J109,'DJU Montsouris'!A:A,0),1):INDEX('DJU Montsouris'!B:B,MATCH(DATE(YEAR(I109),12,31),'DJU Montsouris'!A:A,0),1)))","v":"Dates de chauffe à renseigner"},{"$error":"#N/A"},{"$f":"(INDEX($I$146:$I$154,(MIN(IF(ISBLANK($D$104:$D$112),ROW($D$113),ROW($D$104:$D$112))))-ROW($I$103),1))*E151/(INDEX($E$146:$E$154,(MIN(IF(ISBLANK($D$104:$D$112),ROW($D$113),ROW($D$104:$D$112))))-ROW($I$103),1))","v":{"$error":"#REF!"}},0,0,"","",{"$error":"#N/A"}]
[null,null,0,0,{"$f":"IF(OR(I110=\"\",J110=\"\"), \"Dates de chauffe à renseigner\", SUM(INDEX('DJU Montsouris'!B:B,MATCH(DATE(YEAR(I110),1,1),'DJU Montsouris'!A:A,0),1):INDEX('DJU Montsouris'!B:B,MATCH(I110,'DJU Montsouris'!A:A,0),1),INDEX('DJU Montsouris'!B:B,MATCH(J110,'DJU Montsouris'!A:A,0),1):INDEX('DJU Montsouris'!B:B,MATCH(DATE(YEAR(I110),12,31),'DJU Montsouris'!A:A,0),1)))","v":"Dates de chauffe à renseigner"},{"$error":"#N/A"},{"$f":"(INDEX($I$146:$I$154,(MIN(IF(ISBLANK($D$104:$D$112),ROW($D$113),ROW($D$104:$D$112))))-ROW($I$103),1))*E152/(INDEX($E$146:$E$154,(MIN(IF(ISBLANK($D$104:$D$112),ROW($D$113),ROW($D$104:$D$112))))-ROW($I$103),1))","v":{"$error":"#REF!"}},0,0,"","",{"$error":"#N/A"}]
[null,null,0,0,{"$f":"IF(OR(I111=\"\",J111=\"\"), \"Dates de chauffe à renseigner\", SUM(INDEX('DJU Montsouris'!B:B,MATCH(DATE(YEAR(I111),1,1),'DJU Montsouris'!A:A,0),1):INDEX('DJU Montsouris'!B:B,MATCH(I111,'DJU Montsouris'!A:A,0),1),INDEX('DJU Montsouris'!B:B,MATCH(J111,'DJU Montsouris'!A:A,0),1):INDEX('DJU Montsouris'!B:B,MATCH(DATE(YEAR(I111),12,31),'DJU Montsouris'!A:A,0),1)))","v":"Dates de chauffe à renseigner"},{"$error":"#N/A"},{"$f":"(INDEX($I$146:$I$154,(MIN(IF(ISBLANK($D$104:$D$112),ROW($D$113),ROW($D$104:$D$112))))-ROW($I$103),1))*E153/(INDEX($E$146:$E$154,(MIN(IF(ISBLANK($D$104:$D$112),ROW($D$113),ROW($D$104:$D$112))))-ROW($I$103),1))","v":{"$error":"#REF!"}},0,0,"","",{"$error":"#N/A"}]
[null,null,0,0,{"$f":"IF(OR(I112=\"\",J112=\"\"), \"Dates de chauffe à renseigner\", SUM(INDEX('DJU Montsouris'!B:B,MATCH(DATE(YEAR(I112),1,1),'DJU Montsouris'!A:A,0),1):INDEX('DJU Montsouris'!B:B,MATCH(I112,'DJU Montsouris'!A:A,0),1),INDEX('DJU Montsouris'!B:B,MATCH(J112,'DJU Montsouris'!A:A,0),1):INDEX('DJU Montsouris'!B:B,MATCH(DATE(YEAR(I112),12,31),'DJU Montsouris'!A:A,0),1)))","v":"Dates de chauffe à renseigner"},{"$error":"#N/A"},{"$f":"(INDEX($I$146:$I$154,(MIN(IF(ISBLANK($D$104:$D$112),ROW($D$113),ROW($D$104:$D$112))))-ROW($I$103),1))*E154/(INDEX($E$146:$E$154,(MIN(IF(ISBLANK($D$104:$D$112),ROW($D$113),ROW($D$104:$D$112))))-ROW($I$103),1))","v":{"$error":"#REF!"}},0,0,"","",{"$error":"#N/A"}]
[]
[null,null,null,null,null,null,null,null,"Moyenne :",{"$f":"AVERAGE(J146:J154)","v":{"$error":"#DIV/0!"}},{"$f":"AVERAGE(K146:K154)","v":{"$error":"#DIV/0!"}}]

{"sheet":"Fioul Saison de chauffe","index":4,"n_rows":154,"n_cols":13,"rows_kept":154,"cut":false,"hidden":false,"merged":[[1,3,1,11],[2,9,2,10],[100,9,100,10],[100,8,101,8],[100,6,101,6],[100,4,101,4],[100,5,101,5],[100,7,101,7],[100,3,101,3],[123,3,123,5],[2,7,3,7],[2,8,3,8],[2,2,3,3],[2,4,3,4],[2,5,3,5],[2,6,3,6],[100,1,101,2],[25,3,25,5],[99,3,99,10]]}
[null,null,null,null,null,"Analyse des consommations de chauffage (Fioul)"]
[null,null,null,{"$f":"IF(Accueil!A3=2,\"\",\"Attention, vous avez spécifié sur la page Accueil être en chauffage collectif AVEC eau chaude sanitaire\")","v":"Attention, vous avez spécifié sur la page Accueil être en chauffage collectif AVEC eau chaude sanitaire"}]
[null,null,"Saison de chauffe",null,"Quantité en début de saison (litres)","Livraisons (litres)","Quantité en fin de saison (litres)","Facture Chauffage (€ TTC)","Surface habitable chauffée (m2)","Période de chauffe (jj/mm/aaaa)"]
[null,null,null,null,null,null,null,null,null,"Ouverture","Fermeture"]
[null,null,2008,2009,null,null,null,null,null,null,null,{"$f":"IF(OR(AND(J5=\"\",K5<>\"\"),AND(J5<>\"\",K5=\"\")), \"Veuillez remplir les deux dates\", IF(AND(J5=\"\",K5=\"\"),\"\",IF(AND((YEAR(J5))=C5,(YEAR(K5))=D5),\"\",\"Attention, les dates 'Saison de chauffe' et 'période de chauffe' sont différentes\")))","v":""}]
[null,null,2009,2010,null,null,null,null,null,null,null,""]
[null,null,2010,2011,null,null,null,null,null,null,null,""]
[null,null,2011,2012,null,null,null,null,null,null,null,""]
[null,null,2012,2013,null,null,null,null,null,null,null,""]
[null,null,2013,2014,null,null,null,null,null,null,null,""]
[null,null,2014,2015,null,null,null,null,null,null,null,""]
[null,null,2015,2016,null,null,null,null,null,null,null,""]
[null,null,null,null,null,null,null,null,null,null,null,""]
[]
[]
[]
[]
[]
[]
[]
[]
[]
[]
[]
[]
[]
[]
[]
[]
[]
[]
[]
[]
[]
[]
[null,null,null,"Saison de chauffe","Consommation totale (litres)","Consommation Chauffage (kWh PCI)","Consommation chauffage par DJU","Simulation consommation chauffage sans dérive (kWh)","Consommation relative (kWh/m2)","Nombre de DJU","Evolution prix du kWh (c€/kWh)"]
[null,null,null,{"$f":"C5&\"/\"&D5","v":"2008/2009"},{"$f":"E5+F5-G5","v":0},{"$f":"E37*9.97","v":0},{"$f":"IF(F5=\"\",#N/A,F37/J37)","v":{"$error":"#N/A"}},{"$f":"(INDEX($F$37:$F$45,(MIN(IF(ISBLANK($F$5:$F$13),14,ROW($F$5:$F$13))))-4,1))*J37/(INDEX($J$37:$J$45,(MIN(IF(ISBLANK($F$5:$F$13),14,ROW($F$5:$F$13))))-4,1))","v":{"$error":"#REF!"}},{"$f":"IF(F37=0,\"\",F37/I5)","v":""},{"$f":"IF(OR(J5=\"\",K5=\"\"), \"Dates de chauffe à renseigner\", SUM(INDEX('DJU Montsouris'!B:B,MATCH(J5,'DJU Montsouris'!A:A,0),1):INDEX('DJU Montsouris'!B:B,MATCH(K5,'DJU Montsouris'!A:A,0),1)))","v":"Dates de chauffe à renseigner"},{"$f":"IF(AND(F37<>\"\",H5<>\"\"),H5/F37*100,#N/A)","v":{"$error":"#N/A"}}]
[null,null,null,{"$f":"C6&\"/\"&D6","v":"2009/2010"},0,{"$f":"E38*9.97","v":0},{"$error":"#N/A"},{"$f":"(INDEX($F$37:$F$45,(MIN(IF(ISBLANK($F$5:F$13),14,ROW($F$5:F$13))))-4,1))*J38/(INDEX($J$37:$J$45,(MIN(IF(ISBLANK($F$5:F$13),14,ROW($F$5:F$13))))-4,1))","v":{"$error":"#REF!"}},{"$f":"IF(F38=0,\"\",F38/I6)","v":""},{"$f":"IF(OR(J6=\"\",K6=\"\"), \"Dates de chauffe à renseigner\", SUM(INDEX('DJU Montsouris'!B:B,MATCH(J6,'DJU Montsouris'!A:A,0),1):INDEX('DJU Montsouris'!B:B,MATCH(K6,'DJU Montsouris'!A:A,0),1)))","v":"Dates de chauffe à renseigner"},{"$f":"IF(AND(F38<>\"\",H6<>\"\"),H6/F38*100,#N/A)","v":{"$error":"#N/A"}}]
[null,null,null,"2010/2011",0,0,{"$error":"#N/A"},{"$f":"(INDEX($F$37:$F$45,(MIN(IF(ISBLANK($F$5:F$13),14,ROW($F$5:F$13))))-4,1))*J39/(INDEX($J$37:$J$45,(MIN(IF(ISBLANK($F$5:F$13),14,ROW($F$5:F$13))))-4,1))","v":{"$error":"#REF!"}},{"$f":"IF(F39=0,\"\",F39/I7)","v":""},{"$f":"IF(OR(J7=\"\",K7=\"\"), \"Dates de chauffe à renseigner\", SUM(INDEX('DJU Montsouris'!B:B,MATCH(J7,'DJU Montsouris'!A:A,0),1):INDEX('DJU Montsouris'!B:B,MATCH(K7,'DJU Montsouris'!A:A,0),1)))","v":"Dates de chauffe à renseigner"},{"$error":"#N/A"}]
[null,null,null,"2011/2012",0,0,{"$error":"#N/A"},{"$f":"(INDEX($F$37:$F$45,(MIN(IF(ISBLANK($F$5:F$13),14,ROW($F$5:F$13))))-4,1))*J40/(INDEX($J$37:$J$45,(MIN(IF(ISBLANK($F$5:F$13),14,ROW($F$5:F$13))))-4,1))","v":{"$error":"#REF!"}},"",{"$f":"IF(OR(J8=\"\",K8=\"\"), \"Dates de chauffe à renseigner\", SUM(INDEX('DJU Montsouris'!B:B,MATCH(J8,'DJU Montsouris'!A:A,0),1):INDEX('DJU Montsouris'!B:B,MATCH(K8,'DJU Montsouris'!A:A,0),1)))","v":"Dates de chauffe à renseigner"},{"$error":"#N/A"}]
[null,null,null,"2012/2013",0,0,{"$error":"#N/A"},{"$f":"(INDEX($F$37:$F$45,(MIN(IF(ISBLANK($F$5:F$13),14,ROW($F$5:F$13))))-4,1))*J41/(INDEX($J$37:$J$45,(MIN(IF(ISBLANK($F$5:F$13),14,ROW($F$5:F$13))))-4,1))","v":{"$error":"#REF!"}},"",{"$f":"IF(OR(J9=\"\",K9=\"\"), \"Dates de chauffe à renseigner\", SUM(INDEX('DJU Montsouris'!B:B,MATCH(J9,'DJU Montsouris'!A:A,0),1):INDEX('DJU Montsouris'!B:B,MATCH(K9,'DJU Montsouris'!A:A,0),1)))","v":"Dates de chauffe à renseigner"},{"$error":"#N/A"}]
[null,null,null,"2013/2014",0,0,{"$error":"#N/A"},{"$f":"(INDEX($F$37:$F$45,(MIN(IF(ISBLANK($F$5:F$13),14,ROW($F$5:F$13))))-4,1))*J42/(INDEX($J$37:$J$45,(MIN(IF(ISBLANK($F$5:F$13),14,ROW($F$5:F$13))))-4,1))","v":{"$error":"#REF!"}},"",{"$f":"IF(OR(J10=\"\",K10=\"\"), \"Dates de chauffe à renseigner\", SUM(INDEX('DJU Montsouris'!B:B,MATCH(J10,'DJU Montsouris'!A:A,0),1):INDEX('DJU Montsouris'!B:B,MATCH(K10,'DJU Montsouris'!A:A,0),1)))","v":"Dates de chauffe à renseigner"},{"$error":"#N/A"}]
[null,null,null,"2014/2015",0,0,{"$error":"#N/A"},{"$f":"(INDEX($F$37:$F$45,(MIN(IF(ISBLANK($F$5:F$13),14,ROW($F$5:F$13))))-4,1))*J43/(INDEX($J$37:$J$45,(MIN(IF(ISBLANK($F$5:F$13),14,ROW($F$5:F$13))))-4,1))","v":{"$error":"#REF!"}},"",{"$f":"IF(OR(J11=\"\",K11=\"\"), \"Dates de chauffe à renseigner\", SUM(INDEX('DJU Montsouris'!B:B,MATCH(J11,'DJU Montsouris'!A:A,0),1):INDEX('DJU Montsouris'!B:B,MATCH(K11,'DJU Montsouris'!A:A,0),1)))","v":"Dates de chauffe à renseigner"},{"$error":"#N/A"}]
[null,null,null,"2015/2016",0,0,{"$error":"#N/A"},{"$f":"(INDEX($F$37:$F$45,(MIN(IF(ISBLANK($F$5:F$13),14,ROW($F$5:F$13))))-4,1))*J44/(INDEX($J$37:$J$45,(MIN(IF(ISBLANK($F$5:F$13),14,ROW($F$5:F$13))))-4,1))","v":{"$error":"#REF!"}},"",{"$f":"IF(OR(J12=\"\",K12=\"\"), \"Dates de chauffe à renseigner\", SUM(INDEX('DJU Montsouris'!B:B,MATCH(J12,'DJU Montsouris'!A:A,0),1):INDEX('DJU Montsouris'!B:B,MATCH(K12,'DJU Montsouris'!A:A,0),1)))","v":"Dates de chauffe à renseigner"},{"$error":"#N/A"}]
[null,null,null,"/",0,0,{"$error":"#N/A"},{"$f":"(INDEX($F$37:$F$45,(MIN(IF(ISBLANK($F$5:F$13),14,ROW($F$5:F$13))))-4,1))*J45/(INDEX($J$37:$J$45,(MIN(IF(ISBLANK($F$5:F$13),14,ROW($F$5:F$13))))-4,1))","v":{"$error":"#REF!"}},"",{"$f":"IF(OR(J13=\"\",K13=\"\"), \"Dates de chauffe à renseigner\", SUM(INDEX('DJU Montsouris'!B:B,MATCH(J13,'DJU Montsouris'!A:A,0),1):INDEX('DJU Montsouris'!B:B,MATCH(K13,'DJU Montsouris'!A:A,0),1)))","v":"Dates de chauffe à renseigner"},{"$error":"#N/A"}]
[]
[null,null,null,null,null,null,null,"Moyenne :",{"$f":"AVERAGE(I37:I45)","v":{"$error":"#DIV/0!"}}]
[]
[]
[]
[]
[]
[]
[]
[]
[]
[]
[]
[]
[]
[]
[]
[]
[]
[]
[]
[]
[]
[]
[]
[]
[]
[]
[]
[]
[]
[]
[]
[]
[]
[]
[]
[]
[]
[]
[]
[]
[]
[]
[]
[]
[]
[]
[]
[]
[]
[]
[null,null,null,null,null,"Analyse des consommations de chauffage et d'ECS (Fioul)"]
[]
[null,null,null,{"$f":"IF(Accueil!A3=1,\"\",\"Attention, vous avez spécifié sur la page Accueil être en chauffage collectif SANS eau chaude sanitaire\")","v":""}]
[null,"Saison de chauffe",null,"Quantité en début de saison (litres)","Livraison (litres)","Quantité en fin de saison (litres)","Consommation d'ECS (m3)","Facture (€ TTC)","Surface habitable chauffée (m2)","Période de chauffe"]
[null,null,null,null,null,null,null,null,null,"Ouverture","Fermeture"]
[null,2008,2009,null,null,null,null,null,null,null,null,{"$f":"IF(OR(AND(J103=\"\",K103<>\"\"),AND(J103<>\"\",K103=\"\")), \"Veuillez remplir les deux dates\", IF(AND(J103=\"\",K103=\"\"),\"\",IF(AND((YEAR(J103))=B103,(YEAR(K103))=C103),\"\",\"Attention, les dates 'Saison de chauffe' et 'période de chauffe' sont différentes\")))","v":""}]
[null,2009,2010,null,null,null,null,null,null,null,null,{"$f":"IF(OR(AND(J104=\"\",K104<>\"\"),AND(J104<>\"\",K104=\"\")), \"Veuillez remplir les deux dates\", IF(AND(J104=\"\",K104=\"\"),\"\",IF(AND((YEAR(J104))=B104,(YEAR(K104))=C104),\"\",\"Attention, les dates 'Saison de chauffe' et 'période de chauffe' sont différentes\")))","v":""}]
[null,2010,2011,null,null,null,null,null,null,null,null,""]
[null,2011,2012,null,null,null,null,null,null,null,null,""]
[null,2012,2013,null,null,null,null,null,null,null,null,""]
[null,2013,2014,null,null,null,null,null,null,null,null,""]
[null,2014,2015,null,null,null,null,null,null,null,null,""]
[null,2015,2016,null,null,null,null,null,null,null,null,""]
[null,null,null,null,null,null,null,null,null,null,null,""]
[]
[]
[]
[]
[]
[]
[]
[]
[]
[]
[]
[]
[]
[]
[]
[]
[]
[]
[]
[]
[]
[]
[]
[]
[]
[]
[]
[]
[]
[]
[]
[null,null,"Saison","Consommation totale (litres)","Consommation totale (kWh)","Nombre de DJU","Consommation chauffage par DJU","Simulation consommation chauffage sans dérive (kWh)","Consommation d'énergie ECS (kWh)","Consommation chauffage (kWh)","Consommation chauffage + ECS (kWh/m2)","Consommation chauffage (kWh/m2)","Evolution prix du kWh"]
[null,null,{"$f":"B103&\"/\"&C103","v":"2008/2009"},{"$f":"D103+E103-F103","v":0},{"$f":"D144*9.97","v":0},{"$f":"IF(OR(J103=\"\",K103=\"\"), \"Dates de chauffe à renseigner\", SUM(INDEX('DJU Montsouris'!B:B,MATCH(J103,'DJU Montsouris'!A:A,0),1):INDEX('DJU Montsouris'!B:B,MATCH(K103,'DJU Montsouris'!A:A,0),1)))","v":"Dates de chauffe à renseigner"},{"$f":"IF(J144=0,#N/A,J144/F144)","v":{"$error":"#N/A"}},{"$f":"(INDEX($J$144:$J$152,(MIN(IF(ISBLANK($E$103:$E$111),ROW($E$112),ROW($E$103:$E$111))))-ROW($J$102),1))*F144/(INDEX($F$144:$F$152,(MIN(IF(ISBLANK($E$103:$E$111),ROW($E$112),ROW($E$103:$E$111))))-ROW($J$102),1))","v":{"$error":"#REF!"}},{"$f":"120*G103","v":0},{"$f":"E144-I144","v":0},{"$f":"IF(E144=0,\"\",E144/I103)","v":""},{"$f":"IF(J144=0,\"\",J144/I103)","v":""},{"$f":"IF(AND(E144<>0,H103<>\"\"),H103/E144*100,#N/A)","v":{"$error":"#N/A"}}]
[null,null,{"$f":"B104&\"/\"&C104","v":"2009/2010"},0,{"$f":"D145*9.97","v":0},{"$f":"IF(OR(J104=\"\",K104=\"\"), \"Dates de chauffe à renseigner\", SUM(INDEX('DJU Montsouris'!B:B,MATCH(J104,'DJU Montsouris'!A:A,0),1):INDEX('DJU Montsouris'!B:B,MATCH(K104,'DJU Montsouris'!A:A,0),1)))","v":"Dates de chauffe à renseigner"},{"$f":"IF(J145=0,#N/A,J145/F145)","v":{"$error":"#N/A"}},{"$f":"(INDEX($J$144:$J$152,(MIN(IF(ISBLANK($E$103:$E$111),ROW($E$112),ROW($E$103:$E$111))))-ROW($J$102),1))*F145/(INDEX($F$144:$F$152,(MIN(IF(ISBLANK($E$103:$E$111),ROW($E$112),ROW($E$103:$E$111))))-ROW($J$102),1))","v":{"$error":"#REF!"}},0,{"$f":"E145-I145","v":0},"","",{"$error":"#N/A"}]
[null,null,"2010/2011",0,0,{"$f":"IF(OR(J105=\"\",K105=\"\"), \"Dates de chauffe à renseigner\", SUM(INDEX('DJU Montsouris'!B:B,MATCH(J105,'DJU Montsouris'!A:A,0),1):INDEX('DJU Montsouris'!B:B,MATCH(K105,'DJU Montsouris'!A:A,0),1)))","v":"Dates de chauffe à renseigner"},{"$f":"IF(J146=0,#N/A,J146/F146)","v":{"$error":"#N/A"}},{"$f":"(INDEX($J$144:$J$152,(MIN(IF(ISBLANK($E$103:$E$111),ROW($E$112),ROW($E$103:$E$111))))-ROW($J$102),1))*F146/(INDEX($F$144:$F$152,(MIN(IF(ISBLANK($E$103:$E$111),ROW($E$112),ROW($E$103:$E$111))))-ROW($J$102),1))","v":{"$error":"#REF!"}},0,0,"","",{"$error":"#N/A"}]
[null,null,"2011/2012",0,0,{"$f":"IF(OR(J106=\"\",K106=\"\"), \"Dates de chauffe à renseigner\", SUM(INDEX('DJU Montsouris'!B:B,MATCH(J106,'DJU Montsouris'!A:A,0),1):INDEX('DJU Montsouris'!B:B,MATCH(K106,'DJU Montsouris'!A:A,0),1)))","v":"Dates de chauffe à renseigner"},{"$error":"#N/A"},{"$f":"(INDEX($J$144:$J$152,(MIN(IF(ISBLANK($E$103:$E$111),ROW($E$112),ROW($E$103:$E$111))))-ROW($J$102),1))*F147/(INDEX($F$144:$F$152,(MIN(IF(ISBLANK($E$103:$E$111),ROW($E$112),ROW($E$103:$E$111))))-ROW($J$102),1))","v":{"$error":"#REF!"}},0,0,"","",{"$error":"#N/A"}]
[null,null,"2012/2013",0,0,{"$f":"IF(OR(J107=\"\",K107=\"\"), \"Dates de chauffe à renseigner\", SUM(INDEX('DJU Montsouris'!B:B,MATCH(J107,'DJU Montsouris'!A:A,0),1):INDEX('DJU Montsouris'!B:B,MATCH(K107,'DJU Montsouris'!A:A,0),1)))","v":"Dates de chauffe à renseigner"},{"$error":"#N/A"},{"$f":"(INDEX($J$144:$J$152,(MIN(IF(ISBLANK($E$103:$E$111),ROW($E$112),ROW($E$103:$E$111))))-ROW($J$102),1))*F148/(INDEX($F$144:$F$152,(MIN(IF(ISBLANK($E$103:$E$111),ROW($E$112),ROW($E$103:$E$111))))-ROW($J$102),1))","v":{"$error":"#REF!"}},0,0,"","",{"$error":"#N/A"}]
[null,null,"2013/2014",0,0,{"$f":"IF(OR(J108=\"\",K108=\"\"), \"Dates de chauffe à renseigner\", SUM(INDEX('DJU Montsouris'!B:B,MATCH(J108,'DJU Montsouris'!A:A,0),1):INDEX('DJU Montsouris'!B:B,MATCH(K108,'DJU Montsouris'!A:A,0),1)))","v":"Dates de chauffe à renseigner"},{"$error":"#N/A"},{"$f":"(INDEX($J$144:$J$152,(MIN(IF(ISBLANK($E$103:$E$111),ROW($E$112),ROW($E$103:$E$111))))-ROW($J$102),1))*F149/(INDEX($F$144:$F$152,(MIN(IF(ISBLANK($E$103:$E$111),ROW($E$112),ROW($E$103:$E$111))))-ROW($J$102),1))","v":{"$error":"#REF!"}},0,0,"","",{"$error":"#N/A"}]
[null,null,"2014/2015",0,0,{"$f":"IF(OR(J109=\"\",K109=\"\"), \"Dates de chauffe à renseigner\", SUM(INDEX('DJU Montsouris'!B:B,MATCH(J109,'DJU Montsouris'!A:A,0),1):INDEX('DJU Montsouris'!B:B,MATCH(K109,'DJU Montsouris'!A:A,0),1)))","v":"Dates de chauffe à renseigner"},{"$error":"#N/A"},{"$f":"(INDEX($J$144:$J$152,(MIN(IF(ISBLANK($E$103:$E$111),ROW($E$112),ROW($E$103:$E$111))))-ROW($J$102),1))*F150/(INDEX($F$144:$F$152,(MIN(IF(ISBLANK($E$103:$E$111),ROW($E$112),ROW($E$103:$E$111))))-ROW($J$102),1))","v":{"$error":"#REF!"}},0,0,"","",{"$error":"#N/A"}]
[null,null,"2015/2016",0,0,{"$f":"IF(OR(J110=\"\",K110=\"\"), \"Dates de chauffe à renseigner\", SUM(INDEX('DJU Montsouris'!B:B,MATCH(J110,'DJU Montsouris'!A:A,0),1):INDEX('DJU Montsouris'!B:B,MATCH(K110,'DJU Montsouris'!A:A,0),1)))","v":"Dates de chauffe à renseigner"},{"$error":"#N/A"},{"$f":"(INDEX($J$144:$J$152,(MIN(IF(ISBLANK($E$103:$E$111),ROW($E$112),ROW($E$103:$E$111))))-ROW($J$102),1))*F151/(INDEX($F$144:$F$152,(MIN(IF(ISBLANK($E$103:$E$111),ROW($E$112),ROW($E$103:$E$111))))-ROW($J$102),1))","v":{"$error":"#REF!"}},0,0,"","",{"$error":"#N/A"}]
[null,null,"/",0,0,{"$f":"IF(OR(J111=\"\",K111=\"\"), \"Dates de chauffe à renseigner\", SUM(INDEX('DJU Montsouris'!B:B,MATCH(J111,'DJU Montsouris'!A:A,0),1):INDEX('DJU Montsouris'!B:B,MATCH(K111,'DJU Montsouris'!A:A,0),1)))","v":"Dates de chauffe à renseigner"},{"$error":"#N/A"},{"$f":"(INDEX($J$144:$J$152,(MIN(IF(ISBLANK($E$103:$E$111),ROW($E$112),ROW($E$103:$E$111))))-ROW($J$102),1))*F152/(INDEX($F$144:$F$152,(MIN(IF(ISBLANK($E$103:$E$111),ROW($E$112),ROW($E$103:$E$111))))-ROW($J$102),1))","v":{"$error":"#REF!"}},0,0,"","",{"$error":"#N/A"}]
[]
[null,null,null,null,null,null,null,null,null,"Moyenne :",{"$f":"AVERAGE(K144:K152)","v":{"$error":"#DIV/0!"}},{"$f":"AVERAGE(L144:L152)","v":{"$error":"#DIV/0!"}}]

{"sheet":"CPCU Année","index":5,"n_rows":147,"n_cols":10,"rows_kept":147,"cut":false,"hidden":false,"merged":[[100,1,101,1],[100,2,101,2],[100,3,101,3],[100,4,101,4],[1,3,1,8],[25,2,25,4],[123,3,123,5],[100,5,101,5],[100,6,100,7],[99,2,99,8],[2,2,3,2],[2,3,3,3],[2,4,3,4],[2,5,3,5],[2,6,2,7]]}
[null,null,null,null,"Analyse des consommations de chauffage (Chauffage Urbain)"]
[null,null,null,{"$f":"IF(Accueil!A3=2,\"\",\"Attention, vous avez spécifié sur la page Accueil être en chauffage collectif AVEC eau chaude sanitaire\")","v":"Attention, vous avez spécifié sur la page Accueil être en chauffage collectif AVEC eau chaude sanitaire"}]
[null,null,"Année","Consommation Chauffage (kWh)","Facture Chauffage (€ TTC)","Surface habitable chauffée (m2)","Période de chauffe (jj/mm/aaaa)"]
[null,null,null,null,null,null,"Fermeture","Ouverture"]
[null,null,2009,null,null,null,null,null,{"$f":"IF(OR(AND(G5=\"\",H5<>\"\"),AND(G5<>\"\",H5=\"\")),\"Veuillez remplir les deux dates\",IF(AND(G5=\"\",H5=\"\"),\"\",IF(AND((YEAR(G5))=C5,(YEAR(H5))=C5),\"\",CONCATENATE(\"Attention, les dates de la 'période de chauffe' ne correspondent pas à \",C5) )))","v":""}]
[null,null,2010,null,null,null,null,null,""]
[null,null,2011,null,null,null,null,null,""]
[null,null,2012,null,null,null,null,null,""]
[null,null,2013,null,null,null,null,null,""]
[null,null,2014,null,null,null,null,null,""]
[null,null,2015,null,null,null,null,null,""]
[null,null,2016,null,null,null,null,null,""]
[null,null,null,null,null,null,null,null,""]
[]
[]
[]
[]
[]
[]
[]
[]
[]
[]
[]
[]
[]
[]
[]
[]
[]
[]
[]
[]
[]
[]
[null,null,"Année","Consommation chauffage par DJU","Simulation consommation chauffage sans dérive (kWh)","Consommation relative (kWh/m2)","Nombre de DJU","Evolution prix du kWh"]
[null,null,{"$f":"C5","v":2009},{"$f":"IF(D5<>\"\",D5/G37,#N/A)","v":{"$error":"#N/A"}},{"$f":"(INDEX($D$5:$D$13,(MIN(IF(ISBLANK($D$5:$D$13),ROW($D$14),ROW($D$5:$D$13))))-ROW($G$4),1))*G37/(INDEX($G$37:$G$45,(MIN(IF(ISBLANK($D$5:$D$13),ROW($D$14),ROW($D$5:$D$13))))-ROW($G$4),1))","v":{"$error":"#REF!"}},{"$f":"IF(D5=\"\",\"\",D5/F5)","v":""},{"$f":"IF(OR(G5=\"\",H5=\"\"), \"Dates de chauffe à renseigner\", SUM(INDEX('DJU Montsouris'!B:B,MATCH(DATE(YEAR(G5),1,1),'DJU Montsouris'!A:A,0),1):INDEX('DJU Montsouris'!B:B,MATCH(G5,'DJU Montsouris'!A:A,0),1),INDEX('DJU Montsouris'!B:B,MATCH(H5,'DJU Montsouris'!A:A,0),1):INDEX('DJU Montsouris'!B:B,MATCH(DATE(YEAR(G5),12,31),'DJU Montsouris'!A:A,0),1)))","v":"Dates de chauffe à renseigner"},{"$f":"IF(AND(D5<>\"\",E5<>\"\"),E5/D5*100,#N/A)","v":{"$error":"#N/A"}}]
[null,null,{"$f":"C6","v":2010},{"$f":"IF(D6<>\"\",D6/G38,#N/A)","v":{"$error":"#N/A"}},{"$f":"(INDEX($D$5:$D$13,(MIN(IF(ISBLANK($D$5:$D$13),ROW($D$14),ROW($D$5:$D$13))))-ROW($G$4),1))*G38/(INDEX($G$37:$G$45,(MIN(IF(ISBLANK($D$5:$D$13),ROW($D$14),ROW($D$5:$D$13))))-ROW($G$4),1))","v":{"$error":"#REF!"}},{"$f":"IF(D6=\"\",\"\",D6/F6)","v":""},{"$f":"IF(OR(G6=\"\",H6=\"\"), \"Dates de chauffe à renseigner\", SUM(INDEX('DJU Montsouris'!B:B,MATCH(DATE(YEAR(G6),1,1),'DJU Montsouris'!A:A,0),1):INDEX('DJU Montsouris'!B:B,MATCH(G6,'DJU Montsouris'!A:A,0),1),INDEX('DJU Montsouris'!B:B,MATCH(H6,'DJU Montsouris'!A:A,0),1):INDEX('DJU Montsouris'!B:B,MATCH(DATE(YEAR(G6),12,31),'DJU Montsouris'!A:A,0),1)))","v":"Dates de chauffe à renseigner"},{"$error":"#N/A"}]
[null,null,2011,{"$error":"#N/A"},{"$f":"(INDEX($D$5:$D$13,(MIN(IF(ISBLANK($D$5:$D$13),ROW($D$14),ROW($D$5:$D$13))))-ROW($G$4),1))*G39/(INDEX($G$37:$G$45,(MIN(IF(ISBLANK($D$5:$D$13),ROW($D$14),ROW($D$5:$D$13))))-ROW($G$4),1))","v":{"$error":"#REF!"}},{"$f":"IF(D7=\"\",\"\",D7/F7)","v":""},{"$f":"IF(OR(G7=\"\",H7=\"\"), \"Dates de chauffe à renseigner\", SUM(INDEX('DJU Montsouris'!B:B,MATCH(DATE(YEAR(G7),1,1),'DJU Montsouris'!A:A,0),1):INDEX('DJU Montsouris'!B:B,MATCH(G7,'DJU Montsouris'!A:A,0),1),INDEX('DJU Montsouris'!B:B,MATCH(H7,'DJU Montsouris'!A:A,0),1):INDEX('DJU Montsouris'!B:B,MATCH(DATE(YEAR(G7),12,31),'DJU Montsouris'!A:A,0),1)))","v":"Dates de chauffe à renseigner"},{"$error":"#N/A"}]
[null,null,2012,{"$error":"#N/A"},{"$f":"(INDEX($D$5:$D$13,(MIN(IF(ISBLANK($D$5:$D$13),ROW($D$14),ROW($D$5:$D$13))))-ROW($G$4),1))*G40/(INDEX($G$37:$G$45,(MIN(IF(ISBLANK($D$5:$D$13),ROW($D$14),ROW($D$5:$D$13))))-ROW($G$4),1))","v":{"$error":"#REF!"}},"",{"$f":"IF(OR(G8=\"\",H8=\"\"), \"Dates de chauffe à renseigner\", SUM(INDEX('DJU Montsouris'!B:B,MATCH(DATE(YEAR(G8),1,1),'DJU Montsouris'!A:A,0),1):INDEX('DJU Montsouris'!B:B,MATCH(G8,'DJU Montsouris'!A:A,0),1),INDEX('DJU Montsouris'!B:B,MATCH(H8,'DJU Montsouris'!A:A,0),1):INDEX('DJU Montsouris'!B:B,MATCH(DATE(YEAR(G8),12,31),'DJU Montsouris'!A:A,0),1)))","v":"Dates de chauffe à renseigner"},{"$error":"#N/A"}]
[null,null,2013,{"$error":"#N/A"},{"$f":"(INDEX($D$5:$D$13,(MIN(IF(ISBLANK($D$5:$D$13),ROW($D$14),ROW($D$5:$D$13))))-ROW($G$4),1))*G41/(INDEX($G$37:$G$45,(MIN(IF(ISBLANK($D$5:$D$13),ROW($D$14),ROW($D$5:$D$13))))-ROW($G$4),1))","v":{"$error":"#REF!"}},"",{"$f":"IF(OR(G9=\"\",H9=\"\"), \"Dates de chauffe à renseigner\", SUM(INDEX('DJU Montsouris'!B:B,MATCH(DATE(YEAR(G9),1,1),'DJU Montsouris'!A:A,0),1):INDEX('DJU Montsouris'!B:B,MATCH(G9,'DJU Montsouris'!A:A,0),1),INDEX('DJU Montsouris'!B:B,MATCH(H9,'DJU Montsouris'!A:A,0),1):INDEX('DJU Montsouris'!B:B,MATCH(DATE(YEAR(G9),12,31),'DJU Montsouris'!A:A,0),1)))","v":"Dates de chauffe à renseigner"},{"$error":"#N/A"}]
[null,null,2014,{"$error":"#N/A"},{"$f":"(INDEX($D$5:$D$13,(MIN(IF(ISBLANK($D$5:$D$13),ROW($D$14),ROW($D$5:$D$13))))-ROW($G$4),1))*G42/(INDEX($G$37:$G$45,(MIN(IF(ISBLANK($D$5:$D$13),ROW($D$14),ROW($D$5:$D$13))))-ROW($G$4),1))","v":{"$error":"#REF!"}},"",{"$f":"IF(OR(G10=\"\",H10=\"\"), \"Dates de chauffe à renseigner\", SUM(INDEX('DJU Montsouris'!B:B,MATCH(DATE(YEAR(G10),1,1),'DJU Montsouris'!A:A,0),1):INDEX('DJU Montsouris'!B:B,MATCH(G10,'DJU Montsouris'!A:A,0),1),INDEX('DJU Montsouris'!B:B,MATCH(H10,'DJU Montsouris'!A:A,0),1):INDEX('DJU Montsouris'!B:B,MATCH(DATE(YEAR(G10),12,31),'DJU Montsouris'!A:A,0),1)))","v":"Dates de chauffe à renseigner"},{"$error":"#N/A"}]
[null,null,2015,{"$error":"#N/A"},{"$f":"(INDEX($D$5:$D$13,(MIN(IF(ISBLANK($D$5:$D$13),ROW($D$14),ROW($D$5:$D$13))))-ROW($G$4),1))*G43/(INDEX($G$37:$G$45,(MIN(IF(ISBLANK($D$5:$D$13),ROW($D$14),ROW($D$5:$D$13))))-ROW($G$4),1))","v":{"$error":"#REF!"}},"",{"$f":"IF(OR(G11=\"\",H11=\"\"), \"Dates de chauffe à renseigner\", SUM(INDEX('DJU Montsouris'!B:B,MATCH(DATE(YEAR(G11),1,1),'DJU Montsouris'!A:A,0),1):INDEX('DJU Montsouris'!B:B,MATCH(G11,'DJU Montsouris'!A:A,0),1),INDEX('DJU Montsouris'!B:B,MATCH(H11,'DJU Montsouris'!A:A,0),1):INDEX('DJU Montsouris'!B:B,MATCH(DATE(YEAR(G11),12,31),'DJU Montsouris'!A:A,0),1)))","v":"Dates de chauffe à renseigner"},{"$error":"#N/A"}]
[null,null,2016,{"$error":"#N/A"},{"$f":"(INDEX($D$5:$D$13,(MIN(IF(ISBLANK($D$5:$D$13),ROW($D$14),ROW($D$5:$D$13))))-ROW($G$4),1))*G44/(INDEX($G$37:$G$45,(MIN(IF(ISBLANK($D$5:$D$13),ROW($D$14),ROW($D$5:$D$13))))-ROW($G$4),1))","v":{"$error":"#REF!"}},"",{"$f":"IF(OR(G12=\"\",H12=\"\"), \"Dates de chauffe à renseigner\", SUM(INDEX('DJU Montsouris'!B:B,MATCH(DATE(YEAR(G12),1,1),'DJU Montsouris'!A:A,0),1):INDEX('DJU Montsouris'!B:B,MATCH(G12,'DJU Montsouris'!A:A,0),1),INDEX('DJU Montsouris'!B:B,MATCH(H12,'DJU Montsouris'!A:A,0),1):INDEX('DJU Montsouris'!B:B,MATCH(DATE(YEAR(G12),12,31),'DJU Montsouris'!A:A,0),1)))","v":"Dates de chauffe à renseigner"},{"$error":"#N/A"}]
[null,null,0,{"$error":"#N/A"},{"$f":"(INDEX($D$5:$D$13,(MIN(IF(ISBLANK($D$5:$D$13),ROW($D$14),ROW($D$5:$D$13))))-ROW($G$4),1))*G45/(INDEX($G$37:$G$45,(MIN(IF(ISBLANK($D$5:$D$13),ROW($D$14),ROW($D$5:$D$13))))-ROW($G$4),1))","v":{"$error":"#REF!"}},"",{"$f":"IF(OR(G13=\"\",H13=\"\"), \"Dates de chauffe à renseigner\", SUM(INDEX('DJU Montsouris'!B:B,MATCH(DATE(YEAR(G13),1,1),'DJU Montsouris'!A:A,0),1):INDEX('DJU Montsouris'!B:B,MATCH(G13,'DJU Montsouris'!A:A,0),1),INDEX('DJU Montsouris'!B:B,MATCH(H13,'DJU Montsouris'!A:A,0),1):INDEX('DJU Montsouris'!B:B,MATCH(DATE(YEAR(G13),12,31),'DJU Montsouris'!A:A,0),1)))","v":"Dates de chauffe à renseigner"},{"$error":"#N/A"}]
[]
[null,null,null,null,"Moyenne :",{"$f":"AVERAGE(F37:F45)","v":{"$error":"#DIV/0!"}}]
[]
[]
[]
[]
[]
[]
[]
[]
[]
[]
[]
[]
[]
[]
[]
[]
[]
[]
[]
[]
[]
[]
[]
[]
[]
[]
[]
[]
[]
[]
[]
[]
[]
[]
[]
[]
[]
[]
[]
[]
[]
[]
[]
[]
[]
[]
[]
[]
[]
[]
[]
[null,null,null,null,"Analyse des consommations de chauffage et d'ECS (Chauffage Urbain)"]
[null,null,{"$f":"IF(Accueil!A3=1,\"\",\"Attention, vous avez spécifié sur la page Accueil être en chauffage collectif SANS eau chaude sanitaire\")","v":""}]
[null,"Année","Consommation totale (kWh)","Consommation d'ECS (m3)","Facture (€ TTC)","Surface habitable chauffée (m2)","Période de chauffe"]
[null,null,null,null,null,null,"Fermeture","Ouverture"]
[null,2009,null,null,null,null,null,null,{"$f":"IF(OR(AND(G103=\"\",H103<>\"\"),AND(G103<>\"\",H103=\"\")),\"Veuillez remplir les deux dates\",IF(AND(G103=\"\",H103=\"\"),\"\",IF(AND((YEAR(G103))=B103,(YEAR(H103))=B103),\"\",CONCATENATE(\"Attention, les dates de la 'période de chauffe' ne correspondent pas à \",B103) )))","v":""}]
[null,2010,null,null,null,null,null,null,{"$f":"IF(OR(AND(G104=\"\",H104<>\"\"),AND(G104<>\"\",H104=\"\")),\"Veuillez remplir les deux dates\",IF(AND(G104=\"\",H104=\"\"),\"\",IF(AND((YEAR(G104))=B104,(YEAR(H104))=B104),\"\",CONCATENATE(\"Attention, les dates de la 'période de chauffe' ne correspondent pas à \",B104) )))","v":""}]
[null,2011,null,null,null,null,null,null,""]
[null,2012,null,null,null,null,null,null,""]
[null,2013,null,null,null,null,null,null,""]
[null,2014,null,null,null,null,null,null,""]
[null,2015,null,null,null,null,null,null,""]
[null,2016,null,null,null,null,null,null,""]
[null,null,null,null,null,null,null,null,""]
[]
[]
[]
[]
[]
[]
[]
[]
[]
[]
[]
[]
[]
[]
[]
[]
[]
[]
[]
[]
[]
[]
[]
[]
[null,null,"Nombre de DJU","Consommation chauffage par DJU","Simulation consommation chauffage sans dérive (kWh)","Consommation d'énergie ECS (kWh)","Consommation chauffage (kWh)","Consommation chauffage + ECS (kWh/m2)","Consommation chauffage (kWh/m2)","Evolution prix du kWh"]
[null,null,{"$f":"IF(OR(G103=\"\",H103=\"\"), \"Dates de chauffe à renseigner\", SUM(INDEX('DJU Montsouris'!B:B,MATCH(DATE(YEAR(G103),1,1),'DJU Montsouris'!A:A,0),1):INDEX('DJU Montsouris'!B:B,MATCH(G103,'DJU Montsouris'!A:A,0),1),INDEX('DJU Montsouris'!B:B,MATCH(H103,'DJU Montsouris'!A:A,0),1):INDEX('DJU Montsouris'!B:B,MATCH(DATE(YEAR(G103),12,31),'DJU Montsouris'!A:A,0),1)))","v":"Dates de chauffe à renseigner"},{"$f":"IF(G137=0,#N/A,G137/C137)","v":{"$error":"#N/A"}},{"$f":"(INDEX($G$137:$G$145,(MIN(IF(ISERROR($G$137:$G$145),ROW($G$146),ROW($G$137:$G$145))))-ROW($G$136),1))*C137/(INDEX($C$137:$C$145,(MIN(IF(ISERROR($G$137:$G$145),ROW($G$146),ROW($G$137:$G$145))))-ROW($G$136),1))","v":{"$error":"#REF!"}},{"$f":"96*D103","v":0},{"$f":"IF(C103=\"\",#N/A,C103-F137)","v":{"$error":"#N/A"}},{"$f":"IF(C103=\"\",\"\",C103/F103)","v":""},{"$f":"IF(ISNA(G137),\"\",G137/F103)","v":""},{"$f":"IF(AND(E103<>\"\",C103<>\"\"),E103/C103*100,#N/A)","v":{"$error":"#N/A"}}]
[null,null,{"$f":"IF(OR(G104=\"\",H104=\"\"), \"Dates de chauffe à renseigner\", SUM(INDEX('DJU Montsouris'!B:B,MATCH(DATE(YEAR(G104),1,1),'DJU Montsouris'!A:A,0),1):INDEX('DJU Montsouris'!B:B,MATCH(G104,'DJU Montsouris'!A:A,0),1),INDEX('DJU Montsouris'!B:B,MATCH(H104,'DJU Montsouris'!A:A,0),1):INDEX('DJU Montsouris'!B:B,MATCH(DATE(YEAR(G104),12,31),'DJU Montsouris'!A:A,0),1)))","v":"Dates de chauffe à renseigner"},{"$f":"IF(G138=0,#N/A,G138/C138)","v":{"$error":"#N/A"}},{"$f":"(INDEX($G$137:$G$145,(MIN(IF(ISERROR($G$137:$G$145),ROW($G$146),ROW($G$137:$G$145))))-ROW($G$136),1))*C138/(INDEX($C$137:$C$145,(MIN(IF(ISERROR($G$137:$G$145),ROW($G$146),ROW($G$137:$G$145))))-ROW($G$136),1))","v":{"$error":"#REF!"}},{"$f":"96*D104","v":0},{"$f":"IF(C104=\"\",#N/A, C104-F138)","v":{"$error":"#N/A"}},"","",{"$error":"#N/A"}]
[null,null,{"$f":"IF(OR(G105=\"\",H105=\"\"), \"Dates de chauffe à renseigner\", SUM(INDEX('DJU Montsouris'!B:B,MATCH(DATE(YEAR(G105),1,1),'DJU Montsouris'!A:A,0),1):INDEX('DJU Montsouris'!B:B,MATCH(G105,'DJU Montsouris'!A:A,0),1),INDEX('DJU Montsouris'!B:B,MATCH(H105,'DJU Montsouris'!A:A,0),1):INDEX('DJU Montsouris'!B:B,MATCH(DATE(YEAR(G105),12,31),'DJU Montsouris'!A:A,0),1)))","v":"Dates de chauffe à renseigner"},{"$f":"IF(G139=0,#N/A,G139/C139)","v":{"$error":"#N/A"}},{"$f":"(INDEX($G$137:$G$145,(MIN(IF(ISERROR($G$137:$G$145),ROW($G$146),ROW($G$137:$G$145))))-ROW($G$136),1))*C139/(INDEX($C$137:$C$145,(MIN(IF(ISERROR($G$137:$G$145),ROW($G$146),ROW($G$137:$G$145))))-ROW($G$136),1))","v":{"$error":"#REF!"}},0,{"$error":"#N/A"},"","",{"$error":"#N/A"}]
[null,null,{"$f":"IF(OR(G106=\"\",H106=\"\"), \"Dates de chauffe à renseigner\", SUM(INDEX('DJU Montsouris'!B:B,MATCH(DATE(YEAR(G106),1,1),'DJU Montsouris'!A:A,0),1):INDEX('DJU Montsouris'!B:B,MATCH(G106,'DJU Montsouris'!A:A,0),1),INDEX('DJU Montsouris'!B:B,MATCH(H106,'DJU Montsouris'!A:A,0),1):INDEX('DJU Montsouris'!B:B,MATCH(DATE(YEAR(G106),12,31),'DJU Montsouris'!A:A,0),1)))","v":"Dates de chauffe à renseigner"},{"$error":"#N/A"},{"$f":"(INDEX($G$137:$G$145,(MIN(IF(ISERROR($G$137:$G$145),ROW($G$146),ROW($G$137:$G$145))))-ROW($G$136),1))*C140/(INDEX($C$137:$C$145,(MIN(IF(ISERROR($G$137:$G$145),ROW($G$146),ROW($G$137:$G$145))))-ROW($G$136),1))","v":{"$error":"#REF!"}},0,{"$error":"#N/A"},"","",{"$error":"#N/A"}]
[null,null,{"$f":"IF(OR(G107=\"\",H107=\"\"), \"Dates de chauffe à renseigner\", SUM(INDEX('DJU Montsouris'!B:B,MATCH(DATE(YEAR(G107),1,1),'DJU Montsouris'!A:A,0),1):INDEX('DJU Montsouris'!B:B,MATCH(G107,'DJU Montsouris'!A:A,0),1),INDEX('DJU Montsouris'!B:B,MATCH(H107,'DJU Montsouris'!A:A,0),1):INDEX('DJU Montsouris'!B:B,MATCH(DATE(YEAR(G107),12,31),'DJU Montsouris'!A:A,0),1)))","v":"Dates de chauffe à renseigner"},{"$error":"#N/A"},{"$f":"(INDEX($G$137:$G$145,(MIN(IF(ISERROR($G$137:$G$145),ROW($G$146),ROW($G$137:$G$145))))-ROW($G$136),1))*C141/(INDEX($C$137:$C$145,(MIN(IF(ISERROR($G$137:$G$145),ROW($G$146),ROW($G$137:$G$145))))-ROW($G$136),1))","v":{"$error":"#REF!"}},0,{"$error":"#N/A"},"","",{"$error":"#N/A"}]
[null,null,{"$f":"IF(OR(G108=\"\",H108=\"\"), \"Dates de chauffe à renseigner\", SUM(INDEX('DJU Montsouris'!B:B,MATCH(DATE(YEAR(G108),1,1),'DJU Montsouris'!A:A,0),1):INDEX('DJU Montsouris'!B:B,MATCH(G108,'DJU Montsouris'!A:A,0),1),INDEX('DJU Montsouris'!B:B,MATCH(H108,'DJU Montsouris'!A:A,0),1):INDEX('DJU Montsouris'!B:B,MATCH(DATE(YEAR(G108),12,31),'DJU Montsouris'!A:A,0),1)))","v":"Dates de chauffe à renseigner"},{"$error":"#N/A"},{"$f":"(INDEX($G$137:$G$145,(MIN(IF(ISERROR($G$137:$G$145),ROW($G$146),ROW($G$137:$G$145))))-ROW($G$136),1))*C142/(INDEX($C$137:$C$145,(MIN(IF(ISERROR($G$137:$G$145),ROW($G$146),ROW($G$137:$G$145))))-ROW($G$136),1))","v":{"$error":"#REF!"}},0,{"$error":"#N/A"},"","",{"$error":"#N/A"}]
[null,null,{"$f":"IF(OR(G109=\"\",H109=\"\"), \"Dates de chauffe à renseigner\", SUM(INDEX('DJU Montsouris'!B:B,MATCH(DATE(YEAR(G109),1,1),'DJU Montsouris'!A:A,0),1):INDEX('DJU Montsouris'!B:B,MATCH(G109,'DJU Montsouris'!A:A,0),1),INDEX('DJU Montsouris'!B:B,MATCH(H109,'DJU Montsouris'!A:A,0),1):INDEX('DJU Montsouris'!B:B,MATCH(DATE(YEAR(G109),12,31),'DJU Montsouris'!A:A,0),1)))","v":"Dates de chauffe à renseigner"},{"$error":"#N/A"},{"$f":"(INDEX($G$137:$G$145,(MIN(IF(ISERROR($G$137:$G$145),ROW($G$146),ROW($G$137:$G$145))))-ROW($G$136),1))*C143/(INDEX($C$137:$C$145,(MIN(IF(ISERROR($G$137:$G$145),ROW($G$146),ROW($G$137:$G$145))))-ROW($G$136),1))","v":{"$error":"#REF!"}},0,{"$error":"#N/A"},"","",{"$error":"#N/A"}]
[null,null,{"$f":"IF(OR(G110=\"\",H110=\"\"), \"Dates de chauffe à renseigner\", SUM(INDEX('DJU Montsouris'!B:B,MATCH(DATE(YEAR(G110),1,1),'DJU Montsouris'!A:A,0),1):INDEX('DJU Montsouris'!B:B,MATCH(G110,'DJU Montsouris'!A:A,0),1),INDEX('DJU Montsouris'!B:B,MATCH(H110,'DJU Montsouris'!A:A,0),1):INDEX('DJU Montsouris'!B:B,MATCH(DATE(YEAR(G110),12,31),'DJU Montsouris'!A:A,0),1)))","v":"Dates de chauffe à renseigner"},{"$error":"#N/A"},{"$f":"(INDEX($G$137:$G$145,(MIN(IF(ISERROR($G$137:$G$145),ROW($G$146),ROW($G$137:$G$145))))-ROW($G$136),1))*C144/(INDEX($C$137:$C$145,(MIN(IF(ISERROR($G$137:$G$145),ROW($G$146),ROW($G$137:$G$145))))-ROW($G$136),1))","v":{"$error":"#REF!"}},0,{"$error":"#N/A"},"","",{"$error":"#N/A"}]
[null,null,{"$f":"IF(OR(G111=\"\",H111=\"\"), \"Dates de chauffe à renseigner\", SUM(INDEX('DJU Montsouris'!B:B,MATCH(DATE(YEAR(G111),1,1),'DJU Montsouris'!A:A,0),1):INDEX('DJU Montsouris'!B:B,MATCH(G111,'DJU Montsouris'!A:A,0),1),INDEX('DJU Montsouris'!B:B,MATCH(H111,'DJU Montsouris'!A:A,0),1):INDEX('DJU Montsouris'!B:B,MATCH(DATE(YEAR(G111),12,31),'DJU Montsouris'!A:A,0),1)))","v":"Dates de chauffe à renseigner"},{"$error":"#N/A"},{"$f":"(INDEX($G$137:$G$145,(MIN(IF(ISERROR($G$137:$G$145),ROW($G$146),ROW($G$137:$G$145))))-ROW($G$136),1))*C145/(INDEX($C$137:$C$145,(MIN(IF(ISERROR($G$137:$G$145),ROW($G$146),ROW($G$137:$G$145))))-ROW($G$136),1))","v":{"$error":"#REF!"}},0,{"$error":"#N/A"},"","",{"$error":"#N/A"}]
[]
[null,null,null,null,null,null,"Moyenne :",{"$f":"AVERAGE(H137:H145)","v":{"$error":"#DIV/0!"}},{"$f":"AVERAGE(I137:I145)","v":{"$error":"#DIV/0!"}}]

{"sheet":"CPCU Saison de chauffe","index":6,"n_rows":151,"n_cols":11,"rows_kept":151,"cut":false,"hidden":false,"merged":[[99,3,99,9],[100,7,100,8],[25,3,25,5],[51,4,51,11],[1,3,1,8],[2,2,3,3],[2,4,3,4],[2,5,3,5],[2,6,3,6],[2,7,2,8],[100,6,101,6],[123,3,123,5],[100,1,101,2],[100,3,101,3],[100,4,101,4],[100,5,101,5]]}
[null,null,null,null,"Analyse des consommations de chauffage (Chauffage Urbain)",null,null,null,null,"[il est considéré qu'une tonne vapeur (TV) = 697 kWh]"]
[null,null,null,{"$f":"IF(Accueil!A3=2,\"\",\"Attention, vous avez spécifié sur la page Accueil être en chauffage collectif AVEC eau chaude sanitaire\")","v":"Attention, vous avez spécifié sur la page Accueil être en chauffage collectif AVEC eau chaude sanitaire"}]
[null,null,"Saison de chauffe",null,"Consommation Chauffage (kWh)","Facture Chauffage (€ TTC)","Surface habitable chauffée (m2)","Période de chauffe (jj/mm/aaaa)"]
[null,null,null,null,null,null,null,"Ouverture","Fermeture"]
[null,null,2008,2009,null,null,null,null,null,{"$f":"IF(OR(AND(H5=\"\",I5<>\"\"),AND(H5<>\"\",I5=\"\")), \"Veuillez remplir les deux dates\", IF(AND(H5=\"\",I5=\"\"),\"\",IF(AND((YEAR(H5))=C5,(YEAR(I5))=D5),\"\",\"Attention, les dates 'Saison de chauffe' et 'période de chauffe' sont différentes\")))","v":""}]
[null,null,2009,2010,null,null,null,null,null,{"$f":"IF(OR(AND(H6=\"\",I6<>\"\"),AND(H6<>\"\",I6=\"\")), \"Veuillez remplir les deux dates\", IF(AND(H6=\"\",I6=\"\"),\"\",IF(AND((YEAR(H6))=C6,(YEAR(I6))=D6),\"\",\"Attention, les dates 'Saison de chauffe' et 'période de chauffe' sont différentes\")))","v":""}]
[null,null,2010,2011,null,null,null,null,null,""]
[null,null,2011,2012,null,null,null,null,null,""]
[null,null,2012,2013,null,null,null,null,null,""]
[null,null,2013,2014,null,null,null,null,null,""]
[null,null,2014,2015,null,null,null,null,null,""]
[null,null,2015,2016,null,null,null,null,null,""]
[null,null,null,null,null,null,null,null,null,""]
[]
[]
[]
[]
[]
[]
[]
[]
[]
[]
[]
[]
[]
[]
[]
[]
[]
[]
[]
[]
[]
[]
[null,null,null,"Saison de chauffe","Consommation chauffage par DJU","Simulation consommation chauffage sans dérive (kWh)","Consommation relative (kWh/m2)","Nombre de DJU","Evolution prix du kWh"]
[null,null,null,{"$f":"C5&\"/\"&D5","v":"2008/2009"},{"$f":"IF(E5=\"\",#N/A,E5/H37)","v":{"$error":"#N/A"}},{"$f":"(INDEX($E$5:$E$13,(MIN(IF(ISBLANK($E$5:$E$13),ROW($E$14),ROW($E$5:$E$13))))-ROW($H$4),1))*H37/(INDEX($H$37:$H$45,(MIN(IF(ISBLANK($E$5:$E$13),ROW($E$14),ROW($E$5:$E$13))))-ROW($H$4),1))","v":{"$error":"#REF!"}},{"$f":"IF(E5=\"\",\"\",E5/G5)","v":""},{"$f":"IF(OR(H5=\"\",I5=\"\"), \"Dates de chauffe à renseigner\", SUM(INDEX('DJU Montsouris'!B:B,MATCH(H5,'DJU Montsouris'!A:A,0),1):INDEX('DJU Montsouris'!B:B,MATCH(I5,'DJU Montsouris'!A:A,0),1)))","v":"Dates de chauffe à renseigner"},{"$f":"IF(AND(E5<>\"\",F5<>\"\"),F5/E5*100,#N/A)","v":{"$error":"#N/A"}}]
[null,null,null,{"$f":"C6&\"/\"&D6","v":"2009/2010"},{"$f":"IF(E6=\"\",#N/A,E6/H38)","v":{"$error":"#N/A"}},{"$f":"(INDEX($E$5:$E$13,(MIN(IF(ISBLANK($E$5:$E$13),ROW($E$14),ROW($E$5:$E$13))))-ROW($H$4),1))*H38/(INDEX($H$37:$H$45,(MIN(IF(ISBLANK($E$5:$E$13),ROW($E$14),ROW($E$5:$E$13))))-ROW($H$4),1))","v":{"$error":"#REF!"}},{"$f":"IF(E6=\"\",\"\",E6/G6)","v":""},{"$f":"IF(OR(H6=\"\",I6=\"\"), \"Dates de chauffe à renseigner\", SUM(INDEX('DJU Montsouris'!B:B,MATCH(H6,'DJU Montsouris'!A:A,0),1):INDEX('DJU Montsouris'!B:B,MATCH(I6,'DJU Montsouris'!A:A,0),1)))","v":"Dates de chauffe à renseigner"},{"$error":"#N/A"}]
[null,null,null,"2010/2011",{"$f":"IF(E7=\"\",#N/A,E7/H39)","v":{"$error":"#N/A"}},{"$f":"(INDEX($E$5:$E$13,(MIN(IF(ISBLANK($E$5:$E$13),ROW($E$14),ROW($E$5:$E$13))))-ROW($H$4),1))*H39/(INDEX($H$37:$H$45,(MIN(IF(ISBLANK($E$5:$E$13),ROW($E$14),ROW($E$5:$E$13))))-ROW($H$4),1))","v":{"$error":"#REF!"}},{"$f":"IF(E7=\"\",\"\",E7/G7)","v":""},{"$f":"IF(OR(H7=\"\",I7=\"\"), \"Dates de chauffe à renseigner\", SUM(INDEX('DJU Montsouris'!B:B,MATCH(H7,'DJU Montsouris'!A:A,0),1):INDEX('DJU Montsouris'!B:B,MATCH(I7,'DJU Montsouris'!A:A,0),1)))","v":"Dates de chauffe à renseigner"},{"$error":"#N/A"}]
[null,null,null,"2011/2012",{"$error":"#N/A"},{"$f":"(INDEX($E$5:$E$13,(MIN(IF(ISBLANK($E$5:$E$13),ROW($E$14),ROW($E$5:$E$13))))-ROW($H$4),1))*H40/(INDEX($H$37:$H$45,(MIN(IF(ISBLANK($E$5:$E$13),ROW($E$14),ROW($E$5:$E$13))))-ROW($H$4),1))","v":{"$error":"#REF!"}},"",{"$f":"IF(OR(H8=\"\",I8=\"\"), \"Dates de chauffe à renseigner\", SUM(INDEX('DJU Montsouris'!B:B,MATCH(H8,'DJU Montsouris'!A:A,0),1):INDEX('DJU Montsouris'!B:B,MATCH(I8,'DJU Montsouris'!A:A,0),1)))","v":"Dates de chauffe à renseigner"},{"$error":"#N/A"}]
[null,null,null,"2012/2013",{"$error":"#N/A"},{"$f":"(INDEX($E$5:$E$13,(MIN(IF(ISBLANK($E$5:$E$13),ROW($E$14),ROW($E$5:$E$13))))-ROW($H$4),1))*H41/(INDEX($H$37:$H$45,(MIN(IF(ISBLANK($E$5:$E$13),ROW($E$14),ROW($E$5:$E$13))))-ROW($H$4),1))","v":{"$error":"#REF!"}},"",{"$f":"IF(OR(H9=\"\",I9=\"\"), \"Dates de chauffe à renseigner\", SUM(INDEX('DJU Montsouris'!B:B,MATCH(H9,'DJU Montsouris'!A:A,0),1):INDEX('DJU Montsouris'!B:B,MATCH(I9,'DJU Montsouris'!A:A,0),1)))","v":"Dates de chauffe à renseigner"},{"$error":"#N/A"}]
[null,null,null,"2013/2014",{"$error":"#N/A"},{"$f":"(INDEX($E$5:$E$13,(MIN(IF(ISBLANK($E$5:$E$13),ROW($E$14),ROW($E$5:$E$13))))-ROW($H$4),1))*H42/(INDEX($H$37:$H$45,(MIN(IF(ISBLANK($E$5:$E$13),ROW($E$14),ROW($E$5:$E$13))))-ROW($H$4),1))","v":{"$error":"#REF!"}},"",{"$f":"IF(OR(H10=\"\",I10=\"\"), \"Dates de chauffe à renseigner\", SUM(INDEX('DJU Montsouris'!B:B,MATCH(H10,'DJU Montsouris'!A:A,0),1):INDEX('DJU Montsouris'!B:B,MATCH(I10,'DJU Montsouris'!A:A,0),1)))","v":"Dates de chauffe à renseigner"},{"$error":"#N/A"}]
[null,null,null,"2014/2015",{"$error":"#N/A"},{"$f":"(INDEX($E$5:$E$13,(MIN(IF(ISBLANK($E$5:$E$13),ROW($E$14),ROW($E$5:$E$13))))-ROW($H$4),1))*H43/(INDEX($H$37:$H$45,(MIN(IF(ISBLANK($E$5:$E$13),ROW($E$14),ROW($E$5:$E$13))))-ROW($H$4),1))","v":{"$error":"#REF!"}},"",{"$f":"IF(OR(H11=\"\",I11=\"\"), \"Dates de chauffe à renseigner\", SUM(INDEX('DJU Montsouris'!B:B,MATCH(H11,'DJU Montsouris'!A:A,0),1):INDEX('DJU Montsouris'!B:B,MATCH(I11,'DJU Montsouris'!A:A,0),1)))","v":"Dates de chauffe à renseigner"},{"$error":"#N/A"}]
[null,null,null,"2015/2016",{"$error":"#N/A"},{"$f":"(INDEX($E$5:$E$13,(MIN(IF(ISBLANK($E$5:$E$13),ROW($E$14),ROW($E$5:$E$13))))-ROW($H$4),1))*H44/(INDEX($H$37:$H$45,(MIN(IF(ISBLANK($E$5:$E$13),ROW($E$14),ROW($E$5:$E$13))))-ROW($H$4),1))","v":{"$error":"#REF!"}},"",{"$f":"IF(OR(H12=\"\",I12=\"\"), \"Dates de chauffe à renseigner\", SUM(INDEX('DJU Montsouris'!B:B,MATCH(H12,'DJU Montsouris'!A:A,0),1):INDEX('DJU Montsouris'!B:B,MATCH(I12,'DJU Montsouris'!A:A,0),1)))","v":"Dates de chauffe à renseigner"},{"$error":"#N/A"}]
[null,null,null,"/",{"$error":"#N/A"},{"$f":"(INDEX($E$5:$E$13,(MIN(IF(ISBLANK($E$5:$E$13),ROW($E$14),ROW($E$5:$E$13))))-ROW($H$4),1))*H45/(INDEX($H$37:$H$45,(MIN(IF(ISBLANK($E$5:$E$13),ROW($E$14),ROW($E$5:$E$13))))-ROW($H$4),1))","v":{"$error":"#REF!"}},"",{"$f":"IF(OR(H13=\"\",I13=\"\"), \"Dates de chauffe à renseigner\", SUM(INDEX('DJU Montsouris'!B:B,MATCH(H13,'DJU Montsouris'!A:A,0),1):INDEX('DJU Montsouris'!B:B,MATCH(I13,'DJU Montsouris'!A:A,0),1)))","v":"Dates de chauffe à renseigner"},{"$error":"#N/A"}]
[]
[null,null,null,null,null,"Moyenne : ",{"$f":"AVERAGE(G37:G45)","v":{"$error":"#DIV/0!"}}]
[]
[]
[]
[]
[]
[]
[]
[]
[]
[]
[]
[]
[]
[]
[]
[]
[]
[]
[]
[]
[]
[]
[]
[]
[]
[]
[]
[]
[]
[]
[]
[]
[]
[]
[]
[]
[]
[]
[]
[]
[]
[]
[]
[]
[]
[]
[]
[]
[]
[]
[]
[null,null,null,null,"Analyse des consommations de chauffage et d'ECS (Chauffage Urbain)",null,null,null,null,"[il est considéré qu'une tonne vapeur (TV) = 697 kWh]"]
[null,null,null,{"$f":"IF(Accueil!A3=1,\"\",\"Attention, vous avez spécifié sur la page Accueil être en chauffage collectif SANS eau chaude sanitaire\")","v":""}]
[null,"Saison de chauffe",null,"Consommation totale (kWh)","Consommation d'ECS (m3)","Facture (€ TTC)","Surface habitable chauffée (m2)","Période de chauffe"]
[null,null,null,null,null,null,null,"Ouverture","Fermeture"]
[null,2008,2009,null,null,null,null,null,null,{"$f":"IF(OR(AND(H103=\"\",I103<>\"\"),AND(H103<>\"\",I103=\"\")), \"Veuillez remplir les deux dates\", IF(AND(H103=\"\",I103=\"\"),\"\",IF(AND((YEAR(H103))=B103,(YEAR(I103))=C103),\"\",\"Attention, les dates 'Saison de chauffe' et 'période de chauffe' sont différentes\")))","v":""}]
[null,2009,2010,null,null,null,null,null,null,{"$f":"IF(OR(AND(H104=\"\",I104<>\"\"),AND(H104<>\"\",I104=\"\")), \"Veuillez remplir les deux dates\", IF(AND(H104=\"\",I104=\"\"),\"\",IF(AND((YEAR(H104))=B104,(YEAR(I104))=C104),\"\",\"Attention, les dates 'Saison de chauffe' et 'période de chauffe' sont différentes\")))","v":""}]
[null,2010,2011,null,null,null,null,null,null,""]
[null,2011,2012,null,null,null,null,null,null,""]
[null,2012,2013,null,null,null,null,null,null,""]
[null,2013,2014,null,null,null,null,null,null,""]
[null,2014,2015,null,null,null,null,null,null,""]
[null,2015,2016,null,null,null,null,null,null,""]
[null,null,null,null,null,null,null,null,null,""]
[]
[]
[]
[]
[]
[]
[]
[]
[]
[]
[]
[]
[]
[]
[]
[]
[]
[]
[]
[]
[]
[]
[]
[]
[]
[]
[]
[]
[null,null,"Saison de chauffe","Nombre de DJU","Consommation chauffage par DJU","Simulation consommation chauffage sans dérive (kWh)","Consommation d'énergie ECS (kWh)","Consommation chauffage (kWh)","Consommation chauffage + ECS (kWh/m2)","Consommation chauffage (kWh/m2)","Evolution prix du kWh"]
[null,null,{"$f":"B103&\"/\"&C103","v":"2008/2009"},{"$f":"IF(OR(H103=\"\",I103=\"\"), \"Dates de chauffe à renseigner\", SUM(INDEX('DJU Montsouris'!B:B,MATCH(H103,'DJU Montsouris'!A:A,0),1):INDEX('DJU Montsouris'!B:B,MATCH(I103,'DJU Montsouris'!A:A,0),1)))","v":"Dates de chauffe à renseigner"},{"$f":"IF(H141=0,#N/A,H141/D141)","v":{"$error":"#N/A"}},{"$f":"(INDEX($H$141:$H$149,(MIN(IF(ISERROR($H$141:$H$149),ROW($H$150),ROW($H$141:$H$149))))-ROW($H$140),1))*D141/(INDEX($D$141:$D$149,(MIN(IF(ISERROR($H$141:$H$149),ROW($H$150),ROW($H$141:$H$149))))-ROW($H$140),1))","v":{"$error":"#REF!"}},{"$f":"96*E103","v":0},{"$f":"IF(D103=\"\",#N/A,D103-G141)","v":{"$error":"#N/A"}},{"$f":"IF(D103=\"\",\"\",D103/G103)","v":""},{"$f":"IF(ISNA(H141),\"\",H141/G103)","v":""},{"$f":"IF(AND(F103<>\"\",D103<>\"\"),F103/D103*100,#N/A)","v":{"$error":"#N/A"}}]
[null,null,{"$f":"B104&\"/\"&C104","v":"2009/2010"},{"$f":"IF(OR(H104=\"\",I104=\"\"), \"Dates de chauffe à renseigner\", SUM(INDEX('DJU Montsouris'!B:B,MATCH(H104,'DJU Montsouris'!A:A,0),1):INDEX('DJU Montsouris'!B:B,MATCH(I104,'DJU Montsouris'!A:A,0),1)))","v":"Dates de chauffe à renseigner"},{"$f":"IF(H142=0,#N/A,H142/D142)","v":{"$error":"#N/A"}},{"$f":"(INDEX($H$141:$H$149,(MIN(IF(ISERROR($H$141:$H$149),ROW($H$150),ROW($H$141:$H$149))))-ROW($H$140),1))*D142/(INDEX($D$141:$D$149,(MIN(IF(ISERROR($H$141:$H$149),ROW($H$150),ROW($H$141:$H$149))))-ROW($H$140),1))","v":{"$error":"#REF!"}},{"$f":"96*E104","v":0},{"$error":"#N/A"},"","",{"$error":"#N/A"}]
[null,null,"2010/2011",{"$f":"IF(OR(H105=\"\",I105=\"\"), \"Dates de chauffe à renseigner\", SUM(INDEX('DJU Montsouris'!B:B,MATCH(H105,'DJU Montsouris'!A:A,0),1):INDEX('DJU Montsouris'!B:B,MATCH(I105,'DJU Montsouris'!A:A,0),1)))","v":"Dates de chauffe à renseigner"},{"$f":"IF(H143=0,#N/A,H143/D143)","v":{"$error":"#N/A"}},{"$f":"(INDEX($H$141:$H$149,(MIN(IF(ISERROR($H$141:$H$149),ROW($H$150),ROW($H$141:$H$149))))-ROW($H$140),1))*D143/(INDEX($D$141:$D$149,(MIN(IF(ISERROR($H$141:$H$149),ROW($H$150),ROW($H$141:$H$149))))-ROW($H$140),1))","v":{"$error":"#REF!"}},0,{"$error":"#N/A"},"","",{"$error":"#N/A"}]
[null,null,"2011/2012",{"$f":"IF(OR(H106=\"\",I106=\"\"), \"Dates de chauffe à renseigner\", SUM(INDEX('DJU Montsouris'!B:B,MATCH(H106,'DJU Montsouris'!A:A,0),1):INDEX('DJU Montsouris'!B:B,MATCH(I106,'DJU Montsouris'!A:A,0),1)))","v":"Dates de chauffe à renseigner"},{"$error":"#N/A"},{"$f":"(INDEX($H$141:$H$149,(MIN(IF(ISERROR($H$141:$H$149),ROW($H$150),ROW($H$141:$H$149))))-ROW($H$140),1))*D144/(INDEX($D$141:$D$149,(MIN(IF(ISERROR($H$141:$H$149),ROW($H$150),ROW($H$141:$H$149))))-ROW($H$140),1))","v":{"$error":"#REF!"}},0,{"$error":"#N/A"},"","",{"$error":"#N/A"}]
[null,null,"2012/2013",{"$f":"IF(OR(H107=\"\",I107=\"\"), \"Dates de chauffe à renseigner\", SUM(INDEX('DJU Montsouris'!B:B,MATCH(H107,'DJU Montsouris'!A:A,0),1):INDEX('DJU Montsouris'!B:B,MATCH(I107,'DJU Montsouris'!A:A,0),1)))","v":"Dates de chauffe à renseigner"},{"$error":"#N/A"},{"$f":"(INDEX($H$141:$H$149,(MIN(IF(ISERROR($H$141:$H$149),ROW($H$150),ROW($H$141:$H$149))))-ROW($H$140),1))*D145/(INDEX($D$141:$D$149,(MIN(IF(ISERROR($H$141:$H$149),ROW($H$150),ROW($H$141:$H$149))))-ROW($H$140),1))","v":{"$error":"#REF!"}},0,{"$error":"#N/A"},"","",{"$error":"#N/A"}]
[null,null,"2013/2014",{"$f":"IF(OR(H108=\"\",I108=\"\"), \"Dates de chauffe à renseigner\", SUM(INDEX('DJU Montsouris'!B:B,MATCH(H108,'DJU Montsouris'!A:A,0),1):INDEX('DJU Montsouris'!B:B,MATCH(I108,'DJU Montsouris'!A:A,0),1)))","v":"Dates de chauffe à renseigner"},{"$error":"#N/A"},{"$f":"(INDEX($H$141:$H$149,(MIN(IF(ISERROR($H$141:$H$149),ROW($H$150),ROW($H$141:$H$149))))-ROW($H$140),1))*D146/(INDEX($D$141:$D$149,(MIN(IF(ISERROR($H$141:$H$149),ROW($H$150),ROW($H$141:$H$149))))-ROW($H$140),1))","v":{"$error":"#REF!"}},0,{"$error":"#N/A"},"","",{"$error":"#N/A"}]
[null,null,"2014/2015",{"$f":"IF(OR(H109=\"\",I109=\"\"), \"Dates de chauffe à renseigner\", SUM(INDEX('DJU Montsouris'!B:B,MATCH(H109,'DJU Montsouris'!A:A,0),1):INDEX('DJU Montsouris'!B:B,MATCH(I109,'DJU Montsouris'!A:A,0),1)))","v":"Dates de chauffe à renseigner"},{"$error":"#N/A"},{"$f":"(INDEX($H$141:$H$149,(MIN(IF(ISERROR($H$141:$H$149),ROW($H$150),ROW($H$141:$H$149))))-ROW($H$140),1))*D147/(INDEX($D$141:$D$149,(MIN(IF(ISERROR($H$141:$H$149),ROW($H$150),ROW($H$141:$H$149))))-ROW($H$140),1))","v":{"$error":"#REF!"}},0,{"$error":"#N/A"},"","",{"$error":"#N/A"}]
[null,null,"2015/2016",{"$f":"IF(OR(H110=\"\",I110=\"\"), \"Dates de chauffe à renseigner\", SUM(INDEX('DJU Montsouris'!B:B,MATCH(H110,'DJU Montsouris'!A:A,0),1):INDEX('DJU Montsouris'!B:B,MATCH(I110,'DJU Montsouris'!A:A,0),1)))","v":"Dates de chauffe à renseigner"},{"$error":"#N/A"},{"$f":"(INDEX($H$141:$H$149,(MIN(IF(ISERROR($H$141:$H$149),ROW($H$150),ROW($H$141:$H$149))))-ROW($H$140),1))*D148/(INDEX($D$141:$D$149,(MIN(IF(ISERROR($H$141:$H$149),ROW($H$150),ROW($H$141:$H$149))))-ROW($H$140),1))","v":{"$error":"#REF!"}},0,{"$error":"#N/A"},"","",{"$error":"#N/A"}]
[null,null,"/",{"$f":"IF(OR(H111=\"\",I111=\"\"), \"Dates de chauffe à renseigner\", SUM(INDEX('DJU Montsouris'!B:B,MATCH(H111,'DJU Montsouris'!A:A,0),1):INDEX('DJU Montsouris'!B:B,MATCH(I111,'DJU Montsouris'!A:A,0),1)))","v":"Dates de chauffe à renseigner"},{"$error":"#N/A"},{"$f":"(INDEX($H$141:$H$149,(MIN(IF(ISERROR($H$141:$H$149),ROW($H$150),ROW($H$141:$H$149))))-ROW($H$140),1))*D149/(INDEX($D$141:$D$149,(MIN(IF(ISERROR($H$141:$H$149),ROW($H$150),ROW($H$141:$H$149))))-ROW($H$140),1))","v":{"$error":"#REF!"}},0,{"$error":"#N/A"},"","",{"$error":"#N/A"}]
[]
[null,null,null,null,null,null,null,"Moyenne :",{"$f":"AVERAGE(I141:I149)","v":{"$error":"#DIV/0!"}},{"$f":"AVERAGE(J141:J149)","v":{"$error":"#DIV/0!"}}]

{"sheet":"Aide","index":7,"n_rows":207,"n_cols":13,"rows_kept":207,"cut":false,"hidden":false,"merged":[[57,6,57,11],[58,5,59,5],[58,6,59,6],[58,7,59,7],[58,8,59,8],[58,9,58,10],[182,5,182,7],[81,5,81,7],[107,6,107,21],[158,5,158,11],[159,4,160,4],[159,5,160,5],[159,6,160,6],[159,7,160,7],[159,8,160,8],[159,9,159,10],[159,20,160,20]]}
[]
[]
[]
[]
[null,"Qu'est ce que le Bilan Énergétique Simplifié ? ","Le Bilan Énergétique Simplifié (BES) est un outil d'évaluation de la performance énergétique d'une copropriété"]
[null,null,"Cet outil est destiné aux copropriétés dotées d'une installation de chauffage collectif et/ou d'eau chaude sanitaire collective"]
[]
[null,"Comment l'utiliser ?","Pour utiliser cet outil, sélectionnez votre type d'énergie (gaz, fioul, réseau de chaleur), ainsi que votre période de chauffe considérée."]
[null,null,"La période de chauffe considérée sera choisie en fonction de vos factures ou de vos relevés de consommations. \nPar exemple :"]
[null,null,"    - si votre relevé de consommation se fait à chaque fin ou début de période de chauffe (généralement entre octobre et avril), choisissez \"Saison de chauffe\""]
[null,null,"    - si votre facture et vos relevés de consommations sont annuels, choissisez \"Année\""]
[]
[null,"Les liens ne fonctionnent pas, que faire ?","Si certains liens de la page d'accueil ne fonctionnent pas, il est possible que cela vienne des \"macros excel\". Vous avez alors un message indiquant \"Les macros ont été désactivées\". Cliquez alors sur \"activez le contenu\" et les liens fonctionneront."]
[]
[null,"Quelles sont les limites ?","Cette version contient les données climatiques (Degrés Jours Unifiés ou DJU) du 1er JANVIER 2002 au 30 JUIN 2016"]
[null,null,"Sii les dates saisies sont situées en déhors de cette plage, les calculs ne pourront se faire."]
[]
[null,"Qu'est ce que la simulation de la consomation sans dérive?","La simulation de la consommation sans dérive correspond à la consommation théorique de la copropriété avec une efficacité constante dans le système de chauffage."]
[null,null,"Si la simulation sans dérive est inférieure à la consommation réelle, alors votre système peut être de moins en moins efficace."]
[null,null,"Si la simulation sans dérive est supérieure à la consommation réelle, cela peut s'expliquer par des améliorations apportées (isolation du bâtiment, désembouage du réseau, baisse de la température de consigne…)"]
[]
[null,"Remarques : ","1. La consommation d'eau chaude sanitaire (ECS) est déterminée par le total des consommations des compteurs divisionnaires (individuels) et/ou par le relevé du compteur d'eau froide dite \"réchauffée\" (en chaufferie). Il faut si possible comparer ces 2 mesures pour voir s'il existe un différentiel.\nSi vous n'avez pas de compteurs divisionnaires d'ECS, ni de compteur général d'ECS en chaufferie, vous pouvez prendre comme valeur le 1/3 de la consommation d'eau froide de votre copropriété (on estime qu'il est consommé en moyenne 1/3 d'ECS et 2/3 d'eau froide)."]
[null,null,"2. Nous considérons que l'énergie nécessaire pour fournir aux logements 1m3 d'ECS à 60°C est de 120 kWh PCI (pouvoir calorifique inférieur) dans le cas d'un chauffage au gaz ou au fioul, et de 96  kWh PCI dans le cas d'un chauffage issu d'un réseau de chaleur. Cette valeur, différente d'une installation à l'autre, est donc une approximation et il vous est possible de la modifier si vous en avez une plus proche de votre situation."]
[null,null,"3. La surface habitable chauffée est la somme des surfaces de tous les lots privatifs (on ne considère pas les parties communes, même chauffées)."]
[null,null,"4.  La mesure de la quantité de fioul consommée doit normalement apparaître sur le carnet d'entretien. Il est considéré ici que 1 litre de fioul correspond à 9,97 kWh PCI"]
[]
[null,"Plus d'informations sur le Bilan Énergétique simplifié : LISEZ LE GUIDE !","http://www.unarc.asso.fr/sites/default/files/files/eco-bilan-simplifie.pdf"]
[]
[]
[]
[]
[]
[]
[]
[]
[]
[]
[]
[]
[]
[]
[]
[]
[]
[]
[]
[]
[]
[]
[]
[]
[]
[]
[]
[]
[]
[null,null,null,null,null,null,null,"Analyse des consommations de chauffage (Gaz)"]
[]
[null,null,null,null,null,"Année","Consommation Chauffage (kWh)","Facture chauffage (€ TTC)","Surface habitable chauffée (m2)","Période de chauffe (jj/mm/aaaa)"]
[null,null,null,null,null,null,null,null,null,"Fermeture","Ouverture"]
[null,null,null,null,null,2004,3383000,154787,25000,"2004-05-24","2004-10-10"]
[null,null,null,null,null,2005,3335000,165710,25000,"2005-05-20","2005-10-05"]
[null,null,null,null,null,2006,3378000,178932,25000,"2006-05-08","2006-10-22"]
[null,null,null,null,null,2007,3085000,180232,25000,"2007-04-25","2007-10-16"]
[null,null,null,null,null,2008]
[null,null,null,null,null,2009]
[null,null,null,null,null,2010]
[null,null,null,null,null,2011]
[null,null,null,null,null,2012]
[]
[]
[]
[]
[]
[]
[]
[]
[]
[]
[]
[]
[]
[]
[]
[]
[]
[]
[]
[]
[]
[]
[null,null,null,null,null,"Année","Consommation chauffage par DJU","Simulation consommation chauffage sans dérive (kWh)","Consommation relative (kWh/m2)","Nombre de DJU","Evolution prix du kWh"]
[null,null,null,null,null,{"$f":"F61","v":2004},{"$f":"IF(G61<>\"\",G61/J93,#N/A)","v":1569.6991912545986},{"$f":"(INDEX($G$61:$G$69,(MIN(IF(ISBLANK($G$61:$G$69),ROW($G$70),ROW($G$61:$G$69))))-ROW($J$60),1))*J93/(INDEX($J$93:$J$101,(MIN(IF(ISBLANK($G$61:$G$69),ROW($G$70),ROW($G$61:$G$69))))-ROW($J$60),1))","v":3383000},{"$f":"IF(G61=\"\",\"\",G61/I61)","v":135.32},{"$f":"IF(OR(J61=\"\",K61=\"\"), \"Dates de chauffe à renseigner\", SUM(INDEX('DJU Montsouris'!B:B,MATCH(DATE(YEAR(J61),1,1),'DJU Montsouris'!A:A,0),1):INDEX('DJU Montsouris'!B:B,MATCH(J61,'DJU Montsouris'!A:A,0),1),INDEX('DJU Montsouris'!B:B,MATCH(K61,'DJU Montsouris'!A:A,0),1):INDEX('DJU Montsouris'!B:B,MATCH(DATE(YEAR(J61),12,31),'DJU Montsouris'!A:A,0),1)))","v":2155.190000000001},{"$f":"IF(AND(G61<>\"\",H61<>\"\"),H61/G61*100,#N/A)","v":4.5754360035471473}]
[null,null,null,null,null,{"$f":"F62","v":2005},{"$f":"IF(G62<>\"\",G62/J94,#N/A)","v":1560.1098392174663},{"$f":"(INDEX($G$61:$G$69,(MIN(IF(ISBLANK($G$61:$G$69),ROW($G$70),ROW($G$61:$G$69))))-ROW($J$60),1))*J94/(INDEX($J$93:$J$101,(MIN(IF(ISBLANK($G$61:$G$69),ROW($G$70),ROW($G$61:$G$69))))-ROW($J$60),1))","v":3355498.8701692168},{"$f":"IF(G62=\"\",\"\",G62/I62)","v":133.4},{"$f":"IF(OR(J62=\"\",K62=\"\"), \"Dates de chauffe à renseigner\", SUM(INDEX('DJU Montsouris'!B:B,MATCH(DATE(YEAR(J62),1,1),'DJU Montsouris'!A:A,0),1):INDEX('DJU Montsouris'!B:B,MATCH(J62,'DJU Montsouris'!A:A,0),1),INDEX('DJU Montsouris'!B:B,MATCH(K62,'DJU Montsouris'!A:A,0),1):INDEX('DJU Montsouris'!B:B,MATCH(DATE(YEAR(J62),12,31),'DJU Montsouris'!A:A,0),1)))","v":2137.6699999999992},4.9688155922038977]
[null,null,null,null,null,2006,1658.5164673304657,{"$f":"(INDEX($G$61:$G$69,(MIN(IF(ISBLANK($G$61:$G$69),ROW($G$70),ROW($G$61:$G$69))))-ROW($J$60),1))*J95/(INDEX($J$93:$J$101,(MIN(IF(ISBLANK($G$61:$G$69),ROW($G$70),ROW($G$61:$G$69))))-ROW($J$60),1))","v":3197100.5247797174},{"$f":"IF(G63=\"\",\"\",G63/I63)","v":135.12},{"$f":"IF(OR(J63=\"\",K63=\"\"), \"Dates de chauffe à renseigner\", SUM(INDEX('DJU Montsouris'!B:B,MATCH(DATE(YEAR(J63),1,1),'DJU Montsouris'!A:A,0),1):INDEX('DJU Montsouris'!B:B,MATCH(J63,'DJU Montsouris'!A:A,0),1),INDEX('DJU Montsouris'!B:B,MATCH(K63,'DJU Montsouris'!A:A,0),1):INDEX('DJU Montsouris'!B:B,MATCH(DATE(YEAR(J63),12,31),'DJU Montsouris'!A:A,0),1)))","v":2036.7600000000004},5.2969804618117227]
[null,null,null,null,null,2007,1743.1643659910612,{"$f":"(INDEX($G$61:$G$69,(MIN(IF(ISBLANK($G$61:$G$69),ROW($G$70),ROW($G$61:$G$69))))-ROW($J$60),1))*J96/(INDEX($J$93:$J$101,(MIN(IF(ISBLANK($G$61:$G$69),ROW($G$70),ROW($G$61:$G$69))))-ROW($J$60),1))","v":2778006.5377066508},123.4,{"$f":"IF(OR(J64=\"\",K64=\"\"), \"Dates de chauffe à renseigner\", SUM(INDEX('DJU Montsouris'!B:B,MATCH(DATE(YEAR(J64),1,1),'DJU Montsouris'!A:A,0),1):INDEX('DJU Montsouris'!B:B,MATCH(J64,'DJU Montsouris'!A:A,0),1),INDEX('DJU Montsouris'!B:B,MATCH(K64,'DJU Montsouris'!A:A,0),1):INDEX('DJU Montsouris'!B:B,MATCH(DATE(YEAR(J64),12,31),'DJU Montsouris'!A:A,0),1)))","v":1769.7699999999998},5.8422042139384116]
[null,null,null,null,null,2008,{"$error":"#N/A"},{"$f":"(INDEX($G$61:$G$69,(MIN(IF(ISBLANK($G$61:$G$69),ROW($G$70),ROW($G$61:$G$69))))-ROW($J$60),1))*J97/(INDEX($J$93:$J$101,(MIN(IF(ISBLANK($G$61:$G$69),ROW($G$70),ROW($G$61:$G$69))))-ROW($J$60),1))","v":{"$error":"#VALUE!"}},"",{"$f":"IF(OR(J65=\"\",K65=\"\"), \"Dates de chauffe à renseigner\", SUM(INDEX('DJU Montsouris'!B:B,MATCH(DATE(YEAR(J65),1,1),'DJU Montsouris'!A:A,0),1):INDEX('DJU Montsouris'!B:B,MATCH(J65,'DJU Montsouris'!A:A,0),1),INDEX('DJU Montsouris'!B:B,MATCH(K65,'DJU Montsouris'!A:A,0),1):INDEX('DJU Montsouris'!B:B,MATCH(DATE(YEAR(J65),12,31),'DJU Montsouris'!A:A,0),1)))","v":"Dates de chauffe à renseigner"},{"$error":"#N/A"}]
[null,null,null,null,null,2009,{"$error":"#N/A"},{"$f":"(INDEX($G$61:$G$69,(MIN(IF(ISBLANK($G$61:$G$69),ROW($G$70),ROW($G$61:$G$69))))-ROW($J$60),1))*J98/(INDEX($J$93:$J$101,(MIN(IF(ISBLANK($G$61:$G$69),ROW($G$70),ROW($G$61:$G$69))))-ROW($J$60),1))","v":{"$error":"#VALUE!"}},"",{"$f":"IF(OR(J66=\"\",K66=\"\"), \"Dates de chauffe à renseigner\", SUM(INDEX('DJU Montsouris'!B:B,MATCH(DATE(YEAR(J66),1,1),'DJU Montsouris'!A:A,0),1):INDEX('DJU Montsouris'!B:B,MATCH(J66,'DJU Montsouris'!A:A,0),1),INDEX('DJU Montsouris'!B:B,MATCH(K66,'DJU Montsouris'!A:A,0),1):INDEX('DJU Montsouris'!B:B,MATCH(DATE(YEAR(J66),12,31),'DJU Montsouris'!A:A,0),1)))","v":"Dates de chauffe à renseigner"},{"$error":"#N/A"}]
[null,null,null,null,null,2010,{"$error":"#N/A"},{"$f":"(INDEX($G$61:$G$69,(MIN(IF(ISBLANK($G$61:$G$69),ROW($G$70),ROW($G$61:$G$69))))-ROW($J$60),1))*J99/(INDEX($J$93:$J$101,(MIN(IF(ISBLANK($G$61:$G$69),ROW($G$70),ROW($G$61:$G$69))))-ROW($J$60),1))","v":{"$error":"#VALUE!"}},"",{"$f":"IF(OR(J67=\"\",K67=\"\"), \"Dates de chauffe à renseigner\", SUM(INDEX('DJU Montsouris'!B:B,MATCH(DATE(YEAR(J67),1,1),'DJU Montsouris'!A:A,0),1):INDEX('DJU Montsouris'!B:B,MATCH(J67,'DJU Montsouris'!A:A,0),1),INDEX('DJU Montsouris'!B:B,MATCH(K67,'DJU Montsouris'!A:A,0),1):INDEX('DJU Montsouris'!B:B,MATCH(DATE(YEAR(J67),12,31),'DJU Montsouris'!A:A,0),1)))","v":"Dates de chauffe à renseigner"},{"$error":"#N/A"}]
[null,null,null,null,null,2011,{"$error":"#N/A"},{"$f":"(INDEX($G$61:$G$69,(MIN(IF(ISBLANK($G$61:$G$69),ROW($G$70),ROW($G$61:$G$69))))-ROW($J$60),1))*J100/(INDEX($J$93:$J$101,(MIN(IF(ISBLANK($G$61:$G$69),ROW($G$70),ROW($G$61:$G$69))))-ROW($J$60),1))","v":{"$error":"#VALUE!"}},"",{"$f":"IF(OR(J68=\"\",K68=\"\"), \"Dates de chauffe à renseigner\", SUM(INDEX('DJU Montsouris'!B:B,MATCH(DATE(YEAR(J68),1,1),'DJU Montsouris'!A:A,0),1):INDEX('DJU Montsouris'!B:B,MATCH(J68,'DJU Montsouris'!A:A,0),1),INDEX('DJU Montsouris'!B:B,MATCH(K68,'DJU Montsouris'!A:A,0),1):INDEX('DJU Montsouris'!B:B,MATCH(DATE(YEAR(J68),12,31),'DJU Montsouris'!A:A,0),1)))","v":"Dates de chauffe à renseigner"},{"$error":"#N/A"}]
[null,null,null,null,null,2012,{"$error":"#N/A"},{"$f":"(INDEX($G$61:$G$69,(MIN(IF(ISBLANK($G$61:$G$69),ROW($G$70),ROW($G$61:$G$69))))-ROW($J$60),1))*J101/(INDEX($J$93:$J$101,(MIN(IF(ISBLANK($G$61:$G$69),ROW($G$70),ROW($G$61:$G$69))))-ROW($J$60),1))","v":{"$error":"#VALUE!"}},"",{"$f":"IF(OR(J69=\"\",K69=\"\"), \"Dates de chauffe à renseigner\", SUM(INDEX('DJU Montsouris'!B:B,MATCH(DATE(YEAR(J69),1,1),'DJU Montsouris'!A:A,0),1):INDEX('DJU Montsouris'!B:B,MATCH(J69,'DJU Montsouris'!A:A,0),1),INDEX('DJU Montsouris'!B:B,MATCH(K69,'DJU Montsouris'!A:A,0),1):INDEX('DJU Montsouris'!B:B,MATCH(DATE(YEAR(J69),12,31),'DJU Montsouris'!A:A,0),1)))","v":"Dates de chauffe à renseigner"},{"$error":"#N/A"}]
[]
[null,null,null,null,null,null,null,"Moyenne :",{"$f":"AVERAGE(I93:I101)","v":131.81}]
[]
[]
[]
[]
[]
[]
[]
[]
[]
[]
[]
[]
[]
[]
[]
[]
[]
[]
[]
[]
[]
[]
[]
[]
[]
[]
[]
[]
[]
[]
[]
[]
[]
[]
[]
[]
[]
[]
[]
[]
[]
[]
[]
[]
[]
[]
[]
[]
[]
[]
[]
[]
[]
[]
[null,null,null,null,null,null,null,"Analyse des consommations de chauffage et d'ECS (Gaz)"]
[]
[null,null,null,null,"Année","Consommation totale (kWh)","Consommation d'ECS (m3)","Facture (€ TTC)","Surface habitable chauffée (m2)","Période de chauffe"]
[null,null,null,null,null,null,null,null,null,"Fermeture","Ouverture"]
[null,null,null,null,2003]
[null,null,null,null,2004,1198295,1550,67880,6400,"2004-05-26","2004-10-12"]
[null,null,null,null,2005,1156490,1300,68550,6400,"2005-05-15","2005-10-10"]
[null,null,null,null,2006,1139926,1295,72469,6400,"2006-05-05","2006-10-25"]
[null,null,null,null,2007,1013100,1228,70221,6400,"2007-04-15","2007-10-15"]
[null,null,null,null,2008,1170898,1315,86464,6400,"2008-05-05","2008-10-15"]
[null,null,null,null,2009,1145127,1305,87830,6400,"2009-05-10","2009-10-15"]
[null,null,null,null,2010,1237965,1264,95022,6400,"2010-05-28","2010-10-06"]
[null,null,null,null,2011]
[]
[]
[]
[]
[]
[]
[]
[]
[]
[]
[]
[]
[]
[]
[]
[]
[]
[]
[]
[]
[]
[]
[]
[]
[]
[null,null,null,null,"Année","Nombre de DJU","Consommation chauffage par DJU","Simulation consommation chauffage sans dérive (kWh)","Consommation d'énergie ECS (kWh)","Consommation chauffage (kWh)","Consommation chauffage + ECS (kWh/m2)","Consommation chauffage (kWh/m2 chauffé)","Evolution prix énergie (c€/kWh)"]
[null,null,null,null,2003,{"$f":"IF(OR(J162=\"\",K162=\"\"), \"Dates de chauffe à renseigner\", SUM(INDEX('DJU Montsouris'!B:B,MATCH(DATE(YEAR(J162),1,1),'DJU Montsouris'!A:A,0),1):INDEX('DJU Montsouris'!B:B,MATCH(J162,'DJU Montsouris'!A:A,0),1),INDEX('DJU Montsouris'!B:B,MATCH(K162,'DJU Montsouris'!A:A,0),1):INDEX('DJU Montsouris'!B:B,MATCH(DATE(YEAR(J162),12,31),'DJU Montsouris'!A:A,0),1)))","v":"Dates de chauffe à renseigner"},{"$f":"IF(J197=0,#N/A,J197/F197)","v":{"$error":"#N/A"}},{"$f":"(INDEX($J$197:$J$205,(MIN(IF(ISERROR($J$197:$J$205),ROW($F$206),ROW($J$197:$J$205))))-ROW($F$196),1))*F197/(INDEX($F$197:$F$205,(MIN(IF(ISERROR($J$197:$J$205),ROW($F$206),ROW($J$197:$J$205))))-ROW($F$196),1))","v":{"$error":"#VALUE!"}},{"$f":"120*G162","v":0},{"$f":"IF(F162=\"\",#N/A,F162-I197)","v":{"$error":"#N/A"}},{"$f":"IF(F162=\"\",\"\",F162/I162)","v":""},{"$f":"IF(ISNA(J197),\"\",J197/I162)","v":""},{"$f":"IF(AND(H162<>\"\",F162<>\"\"),H162/F162*100,#N/A)","v":{"$error":"#N/A"}}]
[null,null,null,null,2004,{"$f":"IF(OR(J163=\"\",K163=\"\"), \"Dates de chauffe à renseigner\", SUM(INDEX('DJU Montsouris'!B:B,MATCH(DATE(YEAR(J163),1,1),'DJU Montsouris'!A:A,0),1):INDEX('DJU Montsouris'!B:B,MATCH(J163,'DJU Montsouris'!A:A,0),1),INDEX('DJU Montsouris'!B:B,MATCH(K163,'DJU Montsouris'!A:A,0),1):INDEX('DJU Montsouris'!B:B,MATCH(DATE(YEAR(J163),12,31),'DJU Montsouris'!A:A,0),1)))","v":2148.8000000000011},{"$f":"IF(J198=0,#N/A,J198/F198)","v":471.09782204020826},{"$f":"(INDEX($J$197:$J$205,(MIN(IF(ISERROR($J$197:$J$205),ROW($F$206),ROW($J$197:$J$205))))-ROW($F$196),1))*F198/(INDEX($F$197:$F$205,(MIN(IF(ISERROR($J$197:$J$205),ROW($F$206),ROW($J$197:$J$205))))-ROW($F$196),1))","v":1012294.9999999999},186000,{"$f":"IF(F163=\"\",#N/A, F163-I198)","v":1012295},187.23359375000001,158.17109375000001,5.6647152829645453]
[null,null,null,null,2005,{"$f":"IF(OR(J164=\"\",K164=\"\"), \"Dates de chauffe à renseigner\", SUM(INDEX('DJU Montsouris'!B:B,MATCH(DATE(YEAR(J164),1,1),'DJU Montsouris'!A:A,0),1):INDEX('DJU Montsouris'!B:B,MATCH(J164,'DJU Montsouris'!A:A,0),1),INDEX('DJU Montsouris'!B:B,MATCH(K164,'DJU Montsouris'!A:A,0),1):INDEX('DJU Montsouris'!B:B,MATCH(DATE(YEAR(J164),12,31),'DJU Montsouris'!A:A,0),1)))","v":2100.4599999999991},{"$f":"IF(J199=0,#N/A,J199/F199)","v":476.31947287736989},{"$f":"(INDEX($J$197:$J$205,(MIN(IF(ISERROR($J$197:$J$205),ROW($F$206),ROW($J$197:$J$205))))-ROW($F$196),1))*F199/(INDEX($F$197:$F$205,(MIN(IF(ISERROR($J$197:$J$205),ROW($F$206),ROW($J$197:$J$205))))-ROW($F$196),1))","v":989522.13128257543},156000,1000490,180.70156249999999,156.32656249999999,5.9274183088483259]
[null,null,null,null,2006,{"$f":"IF(OR(J165=\"\",K165=\"\"), \"Dates de chauffe à renseigner\", SUM(INDEX('DJU Montsouris'!B:B,MATCH(DATE(YEAR(J165),1,1),'DJU Montsouris'!A:A,0),1):INDEX('DJU Montsouris'!B:B,MATCH(J165,'DJU Montsouris'!A:A,0),1),INDEX('DJU Montsouris'!B:B,MATCH(K165,'DJU Montsouris'!A:A,0),1):INDEX('DJU Montsouris'!B:B,MATCH(DATE(YEAR(J165),12,31),'DJU Montsouris'!A:A,0),1)))","v":2023.2400000000005},486.60860797532661,{"$f":"(INDEX($J$197:$J$205,(MIN(IF(ISERROR($J$197:$J$205),ROW($F$206),ROW($J$197:$J$205))))-ROW($F$196),1))*F200/(INDEX($F$197:$F$205,(MIN(IF(ISERROR($J$197:$J$205),ROW($F$206),ROW($J$197:$J$205))))-ROW($F$196),1))","v":953143.95746463118},155400,984526,178.1134375,153.8321875,6.3573424941619026]
[null,null,null,null,2007,{"$f":"IF(OR(J166=\"\",K166=\"\"), \"Dates de chauffe à renseigner\", SUM(INDEX('DJU Montsouris'!B:B,MATCH(DATE(YEAR(J166),1,1),'DJU Montsouris'!A:A,0),1):INDEX('DJU Montsouris'!B:B,MATCH(J166,'DJU Montsouris'!A:A,0),1),INDEX('DJU Montsouris'!B:B,MATCH(K166,'DJU Montsouris'!A:A,0),1):INDEX('DJU Montsouris'!B:B,MATCH(DATE(YEAR(J166),12,31),'DJU Montsouris'!A:A,0),1)))","v":1749.2299999999998},494.92633901773928,{"$f":"(INDEX($J$197:$J$205,(MIN(IF(ISERROR($J$197:$J$205),ROW($F$206),ROW($J$197:$J$205))))-ROW($F$196),1))*F201/(INDEX($F$197:$F$205,(MIN(IF(ISERROR($J$197:$J$205),ROW($F$206),ROW($J$197:$J$205))))-ROW($F$196),1))","v":824058.44324739347},147360,865740,158.296875,135.27187499999999,6.9312999703879177]
[null,null,null,null,2008,{"$f":"IF(OR(J167=\"\",K167=\"\"), \"Dates de chauffe à renseigner\", SUM(INDEX('DJU Montsouris'!B:B,MATCH(DATE(YEAR(J167),1,1),'DJU Montsouris'!A:A,0),1):INDEX('DJU Montsouris'!B:B,MATCH(J167,'DJU Montsouris'!A:A,0),1),INDEX('DJU Montsouris'!B:B,MATCH(K167,'DJU Montsouris'!A:A,0),1):INDEX('DJU Montsouris'!B:B,MATCH(DATE(YEAR(J167),12,31),'DJU Montsouris'!A:A,0),1)))","v":2044.6399999999999},495.48967055325147,{"$f":"(INDEX($J$197:$J$205,(MIN(IF(ISERROR($J$197:$J$205),ROW($F$206),ROW($J$197:$J$205))))-ROW($F$196),1))*F202/(INDEX($F$197:$F$205,(MIN(IF(ISERROR($J$197:$J$205),ROW($F$206),ROW($J$197:$J$205))))-ROW($F$196),1))","v":963225.45085629134},157800,1013098,182.95281249999999,158.29656249999999,7.3844177716590176]
[null,null,null,null,2009,{"$f":"IF(OR(J168=\"\",K168=\"\"), \"Dates de chauffe à renseigner\", SUM(INDEX('DJU Montsouris'!B:B,MATCH(DATE(YEAR(J168),1,1),'DJU Montsouris'!A:A,0),1):INDEX('DJU Montsouris'!B:B,MATCH(J168,'DJU Montsouris'!A:A,0),1),INDEX('DJU Montsouris'!B:B,MATCH(K168,'DJU Montsouris'!A:A,0),1):INDEX('DJU Montsouris'!B:B,MATCH(DATE(YEAR(J168),12,31),'DJU Montsouris'!A:A,0),1)))","v":2078.8699999999994},475.51169625806341,{"$f":"(INDEX($J$197:$J$205,(MIN(IF(ISERROR($J$197:$J$205),ROW($F$206),ROW($J$197:$J$205))))-ROW($F$196),1))*F203/(INDEX($F$197:$F$205,(MIN(IF(ISERROR($J$197:$J$205),ROW($F$206),ROW($J$197:$J$205))))-ROW($F$196),1))","v":979351.12930472742},156600,988527,178.92609375000001,154.45734375000001,7.6698916364735092]
[null,null,null,null,2010,{"$f":"IF(OR(J169=\"\",K169=\"\"), \"Dates de chauffe à renseigner\", SUM(INDEX('DJU Montsouris'!B:B,MATCH(DATE(YEAR(J169),1,1),'DJU Montsouris'!A:A,0),1):INDEX('DJU Montsouris'!B:B,MATCH(J169,'DJU Montsouris'!A:A,0),1),INDEX('DJU Montsouris'!B:B,MATCH(K169,'DJU Montsouris'!A:A,0),1):INDEX('DJU Montsouris'!B:B,MATCH(DATE(YEAR(J169),12,31),'DJU Montsouris'!A:A,0),1)))","v":2466.8700000000013},440.34951172943829,{"$f":"(INDEX($J$197:$J$205,(MIN(IF(ISERROR($J$197:$J$205),ROW($F$206),ROW($J$197:$J$205))))-ROW($F$196),1))*F204/(INDEX($F$197:$F$205,(MIN(IF(ISERROR($J$197:$J$205),ROW($F$206),ROW($J$197:$J$205))))-ROW($F$196),1))","v":1162137.0842563291},151680,1086285,193.43203124999999,169.73203125000001,7.6756612666755526]
[null,null,null,null,2011,{"$f":"IF(OR(J170=\"\",K170=\"\"), \"Dates de chauffe à renseigner\", SUM(INDEX('DJU Montsouris'!B:B,MATCH(DATE(YEAR(J170),1,1),'DJU Montsouris'!A:A,0),1):INDEX('DJU Montsouris'!B:B,MATCH(J170,'DJU Montsouris'!A:A,0),1),INDEX('DJU Montsouris'!B:B,MATCH(K170,'DJU Montsouris'!A:A,0),1):INDEX('DJU Montsouris'!B:B,MATCH(DATE(YEAR(J170),12,31),'DJU Montsouris'!A:A,0),1)))","v":"Dates de chauffe à renseigner"},{"$error":"#N/A"},{"$f":"(INDEX($J$197:$J$205,(MIN(IF(ISERROR($J$197:$J$205),ROW($F$206),ROW($J$197:$J$205))))-ROW($F$196),1))*F205/(INDEX($F$197:$F$205,(MIN(IF(ISERROR($J$197:$J$205),ROW($F$206),ROW($J$197:$J$205))))-ROW($F$196),1))","v":{"$error":"#VALUE!"}},0,{"$error":"#N/A"},"","",{"$error":"#N/A"}]
[]
[null,null,null,null,null,null,null,null,null,"Moyenne :",{"$f":"AVERAGE(K197:K205)","v":179.95091517857142},{"$f":"AVERAGE(L197:L205)","v":155.15537946428574}]

{"sheet":"DJU Montsouris","index":8,"n_rows":5296,"n_cols":143,"rows_kept":5296,"cut":false,"hidden":true,"merged":[]}
["DATE","DJ_CHAUFFAGISTE",null,null,null,null,null,null,null,null,null,null,null,null,null,null,null,null,null,null,null,null,null,null,null,null,null,null,null,null,null,null,null,null,null,null,null,null,null,null,null,null,null,null,null,null,null,null,null,null,null,null,null,null,null,null,null,null,null,null,null,null,null,null,null,null,null,null,null,null,null,null,null,null,null,null,null,null,null,null,null,null,null,null,null,null,null,null,null,null,null,null,null,null,null,null,null,null,null,null,null,null,null,null,null,null,null,null,null,null,null,null,null,null,null,null,null,null,null,null,null,null,null,null,null,null,null,null,null,null,null,null,null,null,null,null,null,null,"2013-06-01","2013-07-01","2013-08-01","2013-09-01","2013-10-01"]
["2002-01-01",20]
["2002-01-02",19.100000000000001]
["2002-01-03",17.45]
["2002-01-04",17.45]
["2002-01-05",16.2]
["2002-01-06",15.9]
["2002-01-07",14.05]
["2002-01-08",14.9]
["2002-01-09",14.1]
["2002-01-10",13.5]
["2002-01-11",12.75]
["2002-01-12",15.1]
["2002-01-13",13.75]
["2002-01-14",10.9]
["2002-01-15",10.65]
["2002-01-16",12.4]
["2002-01-17",12.65]
["2002-01-18",11.5]
["2002-01-19",9.6]
["2002-01-20",9.15]
["2002-01-21",8.0500000000000007]
["2002-01-22",8.9499999999999993]
["2002-01-23",9.5500000000000007]
["2002-01-24",7.2]
["2002-01-25",9.4]
["2002-01-26",6.65]
["2002-01-27",4.9000000000000004]
["2002-01-28",4.4000000000000004]
["2002-01-29",10]
["2002-01-30",7.3]
["2002-01-31",7]
["2002-02-01",6.6]
["2002-02-02",6.25]
["2002-02-03",6.7]
["2002-02-04",8.6]
["2002-02-05",6.55]
["2002-02-06",10.050000000000001]
["2002-02-07",11.85]
["2002-02-08",8.25]
["2002-02-09",7.75]
["2002-02-10",9.1]
["2002-02-11",6.85]
["2002-02-12",4.9000000000000004]
["2002-02-13",8.1999999999999993]
["2002-02-14",11.95]
["2002-02-15",15.2]
["2002-02-16",14.55]
["2002-02-17",12.35]
["2002-02-18",13]
["2002-02-19",11.35]
["2002-02-20",7.4]
["2002-02-21",12.6]
["2002-02-22",10.1]
["2002-02-23",10]
["2002-02-24",11.5]
["2002-02-25",8.6999999999999993]
["2002-02-26",4.9000000000000004]
["2002-02-27",9.6]
["2002-02-28",10.45]
["2002-03-01",11.85]
["2002-03-02",14.1]
["2002-03-03",12.55]
["2002-03-04",10.5]
["2002-03-05",10.5]
["2002-03-06",9.65]
["2002-03-07",5.25]
["2002-03-08",6.55]
["2002-03-09",6.05]
["2002-03-10",9.4499999999999993]
["2002-03-11",7.9]
["2002-03-12",6.65]
["2002-03-13",3.96]
["2002-03-14",7.5]
["2002-03-15",6.9]
["2002-03-16",6.2]
["2002-03-17",6.15]
["2002-03-18",7.4]
["2002-03-19",5.65]
["2002-03-20",2.4]
["2002-03-21",3.8]
["2002-03-22",6.25]
["2002-03-23",8.75]
["2002-03-24",9.75]
["2002-03-25",11.1]
["2002-03-26",9.5]
["2002-03-27",10.3]
["2002-03-28",9.4499999999999993]
["2002-03-29",6.75]
["2002-03-30",5.45]
["2002-03-31",6.05]
["2002-04-01",3.91]
["2002-04-02",3.44]
["2002-04-03",3.39]
["2002-04-04",2.8]
["2002-04-05",3.03]
["2002-04-06",7.2]
["2002-04-07",7.9]
["2002-04-08",7.1]
["2002-04-09",8.1999999999999993]
["2002-04-10",8.85]
["2002-04-11",8.35]
["2002-04-12",7.6]
["2002-04-13",9.1999999999999993]
["2002-04-14",10.7]
["2002-04-15",9.35]
["2002-04-16",7.75]
["2002-04-17",7.5]
["2002-04-18",5.3]
["2002-04-19",6.7]
["2002-04-20",6.4]
["2002-04-21",4.57]
["2002-04-22",2.81]
["2002-04-23",3.17]
["2002-04-24",2.15]
["2002-04-25",1.83]
["2002-04-26",5.65]
["2002-04-27",7.1]
["2002-04-28",4.6100000000000003]
["2002-04-29",6.95]
["2002-04-30",4.6500000000000004]
["2002-05-01",4.8499999999999996]
["2002-05-02",7.5]
["2002-05-03",6.9]
["2002-05-04",8.4]
["2002-05-05",9.25]
["2002-05-06",7.3]
["2002-05-07",4.3600000000000003]
["2002-05-08",2.15]
["2002-05-09",3.05]
["2002-05-10",4.45]
["2002-05-11",5.05]
["2002-05-12",3.53]
["2002-05-13",3.46]
["2002-05-14",3.57]
["2002-05-15",3.01]
["2002-05-16",1.44]
["2002-05-17",0.41]
["2002-05-18",2.04]
["2002-05-19",3.12]
["2002-05-20",1.31]
["2002-05-21",0.88]
["2002-05-22",3.45]
["2002-05-23",3.54]
["2002-05-24",3.9]
["2002-05-25",3.32]
["2002-05-26",4.0999999999999996]
["2002-05-27",5.25]
["2002-05-28",6.95]
["2002-05-29",4.54]
["2002-05-30",3.97]
["2002-05-31",2.59]
["2002-06-01",1.1100000000000001]
["2002-06-02",0.55000000000000004]
["2002-06-03",0.04]
["2002-06-04",0.92]
["2002-06-05",1.57]
["2002-06-06",2.64]
["2002-06-07",2.34]
["2002-06-08",1.89]
["2002-06-09",2.86]
["2002-06-10",3.91]
["2002-06-11",2.02]
["2002-06-12",0.83]
["2002-06-13",1.18]
["2002-06-14",0.56999999999999995]
["2002-06-15",0.19]
["2002-06-16",0]
["2002-06-17",0]
["2002-06-18",0]
["2002-06-19",0.48]
["2002-06-20",1.06]
["2002-06-21",0.6]
["2002-06-22",0.12]
["2002-06-23",0.42]
["2002-06-24",1.37]
["2002-06-25",1.23]
["2002-06-26",0.91]
["2002-06-27",1.45]
["2002-06-28",2.5099999999999998]
["2002-06-29",2.39]
["2002-06-30",1.42]
["2002-07-01",2.2999999999999998]
["2002-07-02",2.2000000000000002]
["2002-07-03",1.44]
["2002-07-04",2]
["2002-07-05",3.1]
["2002-07-06",1.21]
["2002-07-07",0.96]
["2002-07-08",1.07]
["2002-07-09",0]
["2002-07-10",1.55]
["2002-07-11",2.09]
["2002-07-12",0.6]
["2002-07-13",1.33]
["2002-07-14",1.61]
["2002-07-15",1.01]
["2002-07-16",0.72]
["2002-07-17",0.6]
["2002-07-18",0.69]
["2002-07-19",0.95]
["2002-07-20",1.01]
["2002-07-21",0.98]
["2002-07-22",1.28]
["2002-07-23",0.65]
["2002-07-24",0.37]
["2002-07-25",0.89]
["2002-07-26",0]
["2002-07-27",0.01]
["2002-07-28",0]
["2002-07-29",0]
["2002-07-30",0]
["2002-07-31",0.42]
["2002-08-01",1.1499999999999999]
["2002-08-02",0.9]
["2002-08-03",1.25]
["2002-08-04",1.55]
["2002-08-05",1.58]
["2002-08-06",1.04]
["2002-08-07",0.39]
["2002-08-08",0.34]
["2002-08-09",1.21]
["2002-08-10",1.18]
["2002-08-11",1.33]
["2002-08-12",0.85]
["2002-08-13",1.27]
["2002-08-14",0.33]
["2002-08-15",0.04]
["2002-08-16",0]
["2002-08-17",0]
["2002-08-18",0]
["2002-08-19",0]
["2002-08-20",0.51]
["2002-08-21",1.1000000000000001]
["2002-08-22",0.59]
["2002-08-23",1.01]
["2002-08-24",0.49]
["2002-08-25",0.67]
["2002-08-26",0.63]
["2002-08-27",0.14000000000000001]
["2002-08-28",0.22]
["2002-08-29",0.28999999999999998]
["2002-08-30",0.38]
["2002-08-31",0.02]
["2002-09-01",1.81]
["2002-09-02",1.77]
["2002-09-03",0.24]
["2002-09-04",0.41]
["2002-09-05",1.42]
["2002-09-06",1.92]
["2002-09-07",0.43]
["2002-09-08",0.8]
["2002-09-09",1.2]
["2002-09-10",1.44]
["2002-09-11",2.15]
["2002-09-12",1.59]
["2002-09-13",1.39]
["2002-09-14",1.7]
["2002-09-15",0.74]
["2002-09-16",2.36]
["2002-09-17",2.02]
["2002-09-18",2.16]
["2002-09-19",2.06]
["2002-09-20",1.61]
["2002-09-21",2.37]
["2002-09-22",3.43]
["2002-09-23",4.0999999999999996]
["2002-09-24",6.25]
["2002-09-25",6.15]
["2002-09-26",4.7]
["2002-09-27",4.8499999999999996]
["2002-09-28",3.87]
["2002-09-29",4.0999999999999996]
["2002-09-30",4.01]
["2002-10-01",3.39]
["2002-10-02",2.2799999999999998]
["2002-10-03",1.0900000000000001]
["2002-10-04",2.35]
["2002-10-05",4.2]
["2002-10-06",2.25]
["2002-10-07",6.95]
["2002-10-08",6.7]
["2002-10-09",5.62]
["2002-10-10",2.65]
["2002-10-11",5.85]
["2002-10-12",5.5]
["2002-10-13",7.4]
["2002-10-14",6]
["2002-10-15",3.55]
["2002-10-16",3.2]
["2002-10-17",7.4]
["2002-10-18",8.85]
["2002-10-19",8.35]
["2002-10-20",7.35]
["2002-10-21",3.46]
["2002-10-22",3.7]
["2002-10-23",6.35]
["2002-10-24",8.1]
["2002-10-25",3.95]
["2002-10-26",4]
["2002-10-27",3.95]
["2002-10-28",6.9]
["2002-10-29",7.75]
["2002-10-30",4.55]
["2002-10-31",4.2]
["2002-11-01",4.8]
["2002-11-02",3.05]
["2002-11-03",5.6]
["2002-11-04",6.15]
["2002-11-05",7.8]
["2002-11-06",9.6]
["2002-11-07",8.6]
["2002-11-08",8.85]
["2002-11-09",7.1]
["2002-11-10",5.65]
["2002-11-11",5.4]
["2002-11-12",7.45]
["2002-11-13",6]
["2002-11-14",6.55]
["2002-11-15",8.4499999999999993]
["2002-11-16",9.35]
["2002-11-17",8.85]
["2002-11-18",9.9499999999999993]
["2002-11-19",11.85]
["2002-11-20",9.3000000000000007]
["2002-11-21",7.1]
["2002-11-22",9.0500000000000007]
["2002-11-23",10.25]
["2002-11-24",9.3000000000000007]
["2002-11-25",9.5]
["2002-11-26",11.35]
["2002-11-27",12.6]
["2002-11-28",10.15]
["2002-11-29",8.9]
["2002-11-30",9.1999999999999993]
["2002-12-01",8.6]
["2002-12-02",10.199999999999999]
["2002-12-03",10.9]
["2002-12-04",11.75]
["2002-12-05",11.1]
["2002-12-06",14.05]
["2002-12-07",15.25]
["2002-12-08",15]
["2002-12-09",17.2]
["2002-12-10",15.95]
["2002-12-11",14.8]
["2002-12-12",14.45]
["2002-12-13",11.85]
["2002-12-14",10.15]
["2002-12-15",9.35]
["2002-12-16",10.45]
["2002-12-17",12.1]
["2002-12-18",14.45]
["2002-12-19",16.75]
["2002-12-20",12.4]
["2002-12-21",7.3]
["2002-12-22",5.2]
["2002-12-23",5.6]
["2002-12-24",5.95]
["2002-12-25",7.3]
["2002-12-26",5.35]
["2002-12-27",5.95]
["2002-12-28",8.75]
["2002-12-29",7.55]
["2002-12-30",6]
["2002-12-31",10.45]
["2003-01-01",8.4499999999999993]
["2003-01-02",5.45]
["2003-01-03",9.1999999999999993]
["2003-01-04",15.2]
["2003-01-05",20.2]
["2003-01-06",19.75]
["2003-01-07",21.1]
["2003-01-08",23.6]
["2003-01-09",23.15]
["2003-01-10",21.25]
["2003-01-11",20.9]
["2003-01-12",20]
["2003-01-13",16.45]
["2003-01-14",11.65]
["2003-01-15",14.15]
["2003-01-16",13.95]
["2003-01-17",14.9]
["2003-01-18",15.35]
["2003-01-19",12]
["2003-01-20",9.65]
["2003-01-21",9.0500000000000007]
["2003-01-22",9.9]
["2003-01-23",10.8]
["2003-01-24",13]
["2003-01-25",14.05]
["2003-01-26",9.85]
["2003-01-27",6.8]
["2003-01-28",10.199999999999999]
["2003-01-29",13.65]
["2003-01-30",16.5]
["2003-01-31",16.600000000000001]
["2003-02-01",16.5]
["2003-02-02",13.45]
["2003-02-03",11.7]
["2003-02-04",14.85]
["2003-02-05",14.55]
["2003-02-06",15.65]
["2003-02-07",14.5]
["2003-02-08",13.1]
["2003-02-09",12.1]
["2003-02-10",13]
["2003-02-11",12.75]
["2003-02-12",17.5]
["2003-02-13",18.850000000000001]
["2003-02-14",18.350000000000001]
["2003-02-15",16.25]
["2003-02-16",17.899999999999999]
["2003-02-17",18.600000000000001]
["2003-02-18",17.899999999999999]
["2003-02-19",16.600000000000001]
["2003-02-20",11.7]
["2003-02-21",11.55]
["2003-02-22",11.85]
["2003-02-23",10.3]
["2003-02-24",8.9499999999999993]
["2003-02-25",8.75]
["2003-02-26",6.65]
["2003-02-27",6.6]
["2003-02-28",7.75]
["2003-03-01",7.65]
["2003-03-02",10.25]
["2003-03-03",12.35]
["2003-03-04",8.4]
["2003-03-05",4.5]
["2003-03-06",8.3000000000000007]
["2003-03-07",9.9499999999999993]
["2003-03-08",8.9499999999999993]
["2003-03-09",6.75]
["2003-03-10",6.8]
["2003-03-11",3.7]
["2003-03-12",6.3]
["2003-03-13",9.15]
["2003-03-14",10.050000000000001]
["2003-03-15",10.8]
["2003-03-16",9.5]
["2003-03-17",7.95]
["2003-03-18",10.1]
["2003-03-19",8]
["2003-03-20",7.8]
["2003-03-21",8.4499999999999993]
["2003-03-22",8.15]
["2003-03-23",5.07]
["2003-03-24",4.2699999999999996]
["2003-03-25",2.98]
["2003-03-26",2.63]
["2003-03-27",2.77]
["2003-03-28",2.02]
["2003-03-29",2.36]
["2003-03-30",2.82]
["2003-03-31",7.3]
["2003-04-01",5.94]
["2003-04-02",10.4]
["2003-04-03",11.35]
["2003-04-04",10.050000000000001]
["2003-04-05",6.7]
["2003-04-06",9]
["2003-04-07",12.8]
["2003-04-08",12.9]
["2003-04-09",12.55]
["2003-04-10",13.7]
["2003-04-11",11.6]
["2003-04-12",6.7]
["2003-04-13",5.55]
["2003-04-14",1.65]
["2003-04-15",1.4]
["2003-04-16",1.4]
["2003-04-17",1.42]
["2003-04-18",1.29]
["2003-04-19",6.4]
["2003-04-20",7.6]
["2003-04-21",4.25]
["2003-04-22",3.8]
["2003-04-23",2.62]
["2003-04-24",2.65]
["2003-04-25",1.23]
["2003-04-26",3]
["2003-04-27",4]
["2003-04-28",1.73]
["2003-04-29",2.02]
["2003-04-30",3.85]
["2003-05-01",4.25]
["2003-05-02",3.4]
["2003-05-03",4.82]
["2003-05-04",2.87]
["2003-05-05",4.0999999999999996]
["2003-05-06",5.6]
["2003-05-07",3.51]
["2003-05-08",1.77]
["2003-05-09",3.85]
["2003-05-10",3.82]
["2003-05-11",3.71]
["2003-05-12",4.55]
["2003-05-13",6.8]
["2003-05-14",6.25]
["2003-05-15",5.9]
["2003-05-16",4.37]
["2003-05-17",3]
["2003-05-18",2.33]
["2003-05-19",3.4]
["2003-05-20",4.5]
["2003-05-21",4.1500000000000004]
["2003-05-22",1.48]
["2003-05-23",2.2200000000000002]
["2003-05-24",2.8]
["2003-05-25",4.03]
["2003-05-26",3.22]
["2003-05-27",2.5099999999999998]
["2003-05-28",1.3]
["2003-05-29",0.38]
["2003-05-30",0.05]
["2003-05-31",0]
["2003-06-01",0]
["2003-06-02",0.06]
["2003-06-03",0.23]
["2003-06-04",0.24]
["2003-06-05",0.96]
["2003-06-06",0.36]
["2003-06-07",0.05]
["2003-06-08",0]
["2003-06-09",0.91]
["2003-06-10",0]
["2003-06-11",0.24]
["2003-06-12",0]
["2003-06-13",0.21]
["2003-06-14",0]
["2003-06-15",0.08]
["2003-06-16",0.26]
["2003-06-17",0]
["2003-06-18",1.21]
["2003-06-19",0]
["2003-06-20",0.11]
["2003-06-21",0.94]
["2003-06-22",0.28000000000000003]
["2003-06-23",0]
["2003-06-24",0.55000000000000004]
["2003-06-25",0.05]
["2003-06-26",0]
["2003-06-27",0.04]
["2003-06-28",0.3]
["2003-06-29",0.08]
["2003-06-30",0]
["2003-07-01",1.34]
["2003-07-02",0.94]
["2003-07-03",1.1499999999999999]
["2003-07-04",1.03]
["2003-07-05",1.45]
["2003-07-06",0.84]
["2003-07-07",0.33]
["2003-07-08",0.46]
["2003-07-09",0.2]
["2003-07-10",0]
["2003-07-11",0]
["2003-07-12",0.36]
["2003-07-13",0.19]
["2003-07-14",0]
["2003-07-15",0]
["2003-07-16",0]
["2003-07-17",0.68]
["2003-07-18",0.24]
["2003-07-19",0]
["2003-07-20",0]
["2003-07-21",0]
["2003-07-22",0.08]
["2003-07-23",0.04]
["2003-07-24",0.09]
["2003-07-25",0.34]
["2003-07-26",0.05]
["2003-07-27",0.03]
["2003-07-28",0.45]
["2003-07-29",0.57999999999999996]
["2003-07-30",0]
["2003-07-31",0.47]
["2003-08-01",0.19]
["2003-08-02",0]
["2003-08-03",0]
["2003-08-04",0]
["2003-08-05",0]
["2003-08-06",0]
["2003-08-07",0]
["2003-08-08",0]
["2003-08-09",0]
["2003-08-10",0]
["2003-08-11",0]
["2003-08-12",0]
["2003-08-13",0]
["2003-08-14",0]
["2003-08-15",0.17]
["2003-08-16",0.05]
["2003-08-17",0]
["2003-08-18",0.02]
["2003-08-19",0]
["2003-08-20",0.69]
["2003-08-21",0.87]
["2003-08-22",0.53]
["2003-08-23",0.15]
["2003-08-24",0.01]
["2003-08-25",0.61]
["2003-08-26",0.53]
["2003-08-27",0.12]
["2003-08-28",0.02]
["2003-08-29",0.57999999999999996]
["2003-08-30",1.83]
["2003-08-31",3.16]
["2003-09-01",1.39]
["2003-09-02",2.75]
["2003-09-03",2.34]
["2003-09-04",1.5]
["2003-09-05",1.8]
["2003-09-06",0.45]
["2003-09-07",2.0299999999999998]
["2003-09-08",2.21]
["2003-09-09",1.08]
["2003-09-10",1.26]
["2003-09-11",0.95]
["2003-09-12",0.64]
["2003-09-13",1.46]
["2003-09-14",1.63]
["2003-09-15",1.1299999999999999]
["2003-09-16",1.1499999999999999]
["2003-09-17",0.83]
["2003-09-18",1.01]
["2003-09-19",0.81]
["2003-09-20",0.86]
["2003-09-21",0.51]
["2003-09-22",0.4]
["2003-09-23",4]
["2003-09-24",5.65]
["2003-09-25",4.16]
["2003-09-26",4.0999999999999996]
["2003-09-27",2.68]
["2003-09-28",2.75]
["2003-09-29",4.42]
["2003-09-30",4.1900000000000004]
["2003-10-01",1.76]
["2003-10-02",0.95]
["2003-10-03",1.25]
["2003-10-04",3.75]
["2003-10-05",8.15]
["2003-10-06",8.9]
["2003-10-07",6]
["2003-10-08",6.5]
["2003-10-09",1.34]
["2003-10-10",2.13]
["2003-10-11",1.5]
["2003-10-12",3.38]
["2003-10-13",3.17]
["2003-10-14",3.8]
["2003-10-15",7.6]
["2003-10-16",7.85]
["2003-10-17",9.1999999999999993]
["2003-10-18",9.65]
["2003-10-19",10.7]
["2003-10-20",10.3]
["2003-10-21",10.199999999999999]
["2003-10-22",12.25]
["2003-10-23",12.95]
["2003-10-24",13.9]
["2003-10-25",11]
["2003-10-26",11.35]
["2003-10-27",13.55]
["2003-10-28",12.45]
["2003-10-29",13.5]
["2003-10-30",9.75]
["2003-10-31",8.6999999999999993]
["2003-11-01",8.65]
["2003-11-02",8.9]
["2003-11-03",4.6500000000000004]
["2003-11-04",7.95]
["2003-11-05",8.4499999999999993]
["2003-11-06",7.7]
["2003-11-07",8.65]
["2003-11-08",11.2]
["2003-11-09",10.95]
["2003-11-10",8.1999999999999993]
["2003-11-11",8.35]
["2003-11-12",9.0500000000000007]
["2003-11-13",9]
["2003-11-14",9]
["2003-11-15",10.6]
["2003-11-16",10.7]
["2003-11-17",10.55]
["2003-11-18",7.7]
["2003-11-19",5.9]
["2003-11-20",10]
["2003-11-21",9.0500000000000007]
["2003-11-22",5]
["2003-11-23",2.11]
["2003-11-24",5.8]
["2003-11-25",8.5]
["2003-11-26",9.1999999999999993]
["2003-11-27",12.2]
["2003-11-28",13.3]
["2003-11-29",11.85]
["2003-11-30",8.9499999999999993]
["2003-12-01",7.9]
["2003-12-02",9.4]
["2003-12-03",10.25]
["2003-12-04",11.55]
["2003-12-05",12.2]
["2003-12-06",13]
["2003-12-07",16.399999999999999]
["2003-12-08",14.55]
["2003-12-09",15.55]
["2003-12-10",16.8]
["2003-12-11",12.65]
["2003-12-12",7.9]
["2003-12-13",5.65]
["2003-12-14",8.9]
["2003-12-15",12.25]
["2003-12-16",13.6]
["2003-12-17",14.65]
["2003-12-18",14.15]
["2003-12-19",12.45]
["2003-12-20",8]
["2003-12-21",11.25]
["2003-12-22",14.15]
["2003-12-23",13.45]
["2003-12-24",11.5]
["2003-12-25",9.6999999999999993]
["2003-12-26",10.85]
["2003-12-27",9.75]
["2003-12-28",11.05]
["2003-12-29",15.7]
["2003-12-30",15.25]
["2003-12-31",15.05]
["2004-01-01",14.9]
["2004-01-02",14.6]
["2004-01-03",18.3]
["2004-01-04",18.100000000000001]
["2004-01-05",14.6]
["2004-01-06",11.3]
["2004-01-07",10.7]
["2004-01-08",12.3]
["2004-01-09",9.1]
["2004-01-10",8.75]
["2004-01-11",6.1]
["2004-01-12",6.8]
["2004-01-13",7.65]
["2004-01-14",11.45]
["2004-01-15",11.85]
["2004-01-16",9.65]
["2004-01-17",12.75]
["2004-01-18",14.1]
["2004-01-19",12.5]
["2004-01-20",9.75]
["2004-01-21",11.05]
["2004-01-22",13.1]
["2004-01-23",12.2]
["2004-01-24",10.35]
["2004-01-25",12.55]
["2004-01-26",16.399999999999999]
["2004-01-27",15.6]
["2004-01-28",15.9]
["2004-01-29",16.05]
["2004-01-30",15.35]
["2004-01-31",11.3]
["2004-02-01",6.05]
["2004-02-02",5.2]
["2004-02-03",5.25]
["2004-02-04",4.2]
["2004-02-05",4.0999999999999996]
["2004-02-06",5.85]
["2004-02-07",9.3000000000000007]
["2004-02-08",10.7]
["2004-02-09",13.45]
["2004-02-10",13.75]
["2004-02-11",10.85]
["2004-02-12",11.5]
["2004-02-13",11.45]
["2004-02-14",10.35]
["2004-02-15",11.3]
["2004-02-16",10.9]
["2004-02-17",12.25]
["2004-02-18",11.9]
["2004-02-19",13.85]
["2004-02-20",14.65]
["2004-02-21",13.45]
["2004-02-22",14.3]
["2004-02-23",14.2]
["2004-02-24",15.05]
["2004-02-25",13.5]
["2004-02-26",16.149999999999999]
["2004-02-27",17.100000000000001]
["2004-02-28",15.25]
["2004-02-29",15.35]
["2004-03-01",16.3]
["2004-03-02",14.2]
["2004-03-03",12.3]
["2004-03-04",11.4]
["2004-03-05",11.1]
["2004-03-06",10.75]
["2004-03-07",11.35]
["2004-03-08",12.8]
["2004-03-09",13.5]
["2004-03-10",16.05]
["2004-03-11",15.8]
["2004-03-12",12.35]
["2004-03-13",8.4]
["2004-03-14",9.35]
["2004-03-15",6.3]
["2004-03-16",3.93]
["2004-03-17",3.48]
["2004-03-18",2.52]
["2004-03-19",6.75]
["2004-03-20",5.4]
["2004-03-21",7.15]
["2004-03-22",10]
["2004-03-23",10.85]
["2004-03-24",11.45]
["2004-03-25",11.95]
["2004-03-26",12.35]
["2004-03-27",12.65]
["2004-03-28",10.45]
["2004-03-29",8.35]
["2004-03-30",6]
["2004-03-31",3.9]
["2004-04-01",3.74]
["2004-04-02",6.55]
["2004-04-03",5.65]
["2004-04-04",5.0999999999999996]
["2004-04-05",7.35]
["2004-04-06",9.5500000000000007]
["2004-04-07",10.4]
["2004-04-08",9.65]
["2004-04-09",10.95]
["2004-04-10",9.15]
["2004-04-11",9.25]
["2004-04-12",8.6]
["2004-04-13",7.75]
["2004-04-14",6]
["2004-04-15",5.42]
["2004-04-16",4.4000000000000004]
["2004-04-17",6.25]
["2004-04-18",8.5]
["2004-04-19",9.6999999999999993]
["2004-04-20",7.65]
["2004-04-21",2.0299999999999998]
["2004-04-22",2.46]
["2004-04-23",4.3600000000000003]
["2004-04-24",3.93]
["2004-04-25",3.18]
["2004-04-26",2.29]
["2004-04-27",1.53]
["2004-04-28",4.5]
["2004-04-29",4.3499999999999996]
["2004-04-30",4.1500000000000004]
["2004-05-01",4.8899999999999997]
["2004-05-02",3.86]
["2004-05-03",2.89]
["2004-05-04",7.6]
["2004-05-05",8.35]
["2004-05-06",7.95]
["2004-05-07",7]
["2004-05-08",8.6999999999999993]
["2004-05-09",8.15]
["2004-05-10",5.15]
["2004-05-11",2.89]
["2004-05-12",5.65]
["2004-05-13",7.95]
["2004-05-14",5.21]
["2004-05-15",2.96]
["2004-05-16",1.88]
["2004-05-17",0.97]
["2004-05-18",0.71]
["2004-05-19",0.44]
["2004-05-20",0.72]
["2004-05-21",3.05]
["2004-05-22",6.2]
["2004-05-23",6.1]
["2004-05-24",4.1399999999999997]
["2004-05-25",2.57]
["2004-05-26",2.4900000000000002]
["2004-05-27",2.89]
["2004-05-28",2.74]
["2004-05-29",1.5]
["2004-05-30",1.5]
["2004-05-31",1.73]
["2004-06-01",2.11]
["2004-06-02",1.4]
["2004-06-03",2.76]
["2004-06-04",2.06]
["2004-06-05",0.56000000000000005]
["2004-06-06",1.08]
["2004-06-07",0.47]
["2004-06-08",0.14000000000000001]
["2004-06-09",0]
["2004-06-10",0]
["2004-06-11",0.1]
["2004-06-12",1.77]
["2004-06-13",1.44]
["2004-06-14",1.68]
["2004-06-15",0.17]
["2004-06-16",0.12]
["2004-06-17",0.61]
["2004-06-18",1.92]
["2004-06-19",3.25]
["2004-06-20",3.98]
["2004-06-21",2.89]
["2004-06-22",1.1000000000000001]
["2004-06-23",0.28999999999999998]
["2004-06-24",2.71]
["2004-06-25",2.41]
["2004-06-26",1.72]
["2004-06-27",0.04]
["2004-06-28",0.99]
["2004-06-29",1.36]
["2004-06-30",0.45]
["2004-07-01",1.36]
["2004-07-02",1.28]
["2004-07-03",1.51]
["2004-07-04",1.81]
["2004-07-05",1.06]
["2004-07-06",1.37]
["2004-07-07",0.48]
["2004-07-08",1.85]
["2004-07-09",2.8]
["2004-07-10",3.83]
["2004-07-11",2.72]
["2004-07-12",2.9]
["2004-07-13",1.47]
["2004-07-14",1.26]
["2004-07-15",0]
["2004-07-16",0.3]
["2004-07-17",0]
["2004-07-18",0]
["2004-07-19",0.63]
["2004-07-20",0.21]
["2004-07-21",0]
["2004-07-22",0.11]
["2004-07-23",0]
["2004-07-24",0.25]
["2004-07-25",0.77]
["2004-07-26",1.1000000000000001]
["2004-07-27",0.74]
["2004-07-28",0.34]
["2004-07-29",0.16]
["2004-07-30",0]
["2004-07-31",0]
["2004-08-01",0.01]
["2004-08-02",0]
["2004-08-03",0]
["2004-08-04",0.01]
["2004-08-05",0]
["2004-08-06",0]
["2004-08-07",0]
["2004-08-08",0]
["2004-08-09",0]
["2004-08-10",0]
["2004-08-11",0.12]
["2004-08-12",0.45]
["2004-08-13",0.56999999999999995]
["2004-08-14",0.31]
["2004-08-15",0.45]
["2004-08-16",7.0000000000000007E-2]
["2004-08-17",0.19]
["2004-08-18",0.04]
["2004-08-19",0.32]
["2004-08-20",1.1100000000000001]
["2004-08-21",1.63]
["2004-08-22",1.6]
["2004-08-23",0.49]
["2004-08-24",0.5]
["2004-08-25",1.5]
["2004-08-26",0.99]
["2004-08-27",1.67]
["2004-08-28",0.39]
["2004-08-29",0.95]
["2004-08-30",1.42]
["2004-08-31",2.29]
["2004-09-01",1.66]
["2004-09-02",1.1000000000000001]
["2004-09-03",0.53]
["2004-09-04",0.11]
["2004-09-05",0]
["2004-09-06",0.01]
["2004-09-07",0.06]
["2004-09-08",0.04]
["2004-09-09",0.3]
["2004-09-10",0]
["2004-09-11",0.15]
["2004-09-12",1.65]
["2004-09-13",1.38]
["2004-09-14",2.13]
["2004-09-15",2.57]
["2004-09-16",3.66]
["2004-09-17",3.67]
["2004-09-18",1.65]
["2004-09-19",1.68]
["2004-09-20",3.28]
["2004-09-21",2.5]
["2004-09-22",2.99]
["2004-09-23",0.76]
["2004-09-24",4.5]
["2004-09-25",4.7]
["2004-09-26",2.77]
["2004-09-27",2.0499999999999998]
["2004-09-28",2.6]
["2004-09-29",1.47]
["2004-09-30",1.33]
["2004-10-01",1.39]
["2004-10-02",3.1]
["2004-10-03",4.0599999999999996]
["2004-10-04",2.2400000000000002]
["2004-10-05",3.3]
["2004-10-06",3.75]
["2004-10-07",6.65]
["2004-10-08",5.5]
["2004-10-09",6.85]
["2004-10-10",5.85]
["2004-10-11",5.6]
["2004-10-12",2.59]
["2004-10-13",5.4]
["2004-10-14",5.4]
["2004-10-15",8.6999999999999993]
["2004-10-16",8.8000000000000007]
["2004-10-17",7.8]
["2004-10-18",6.7]
["2004-10-19",6.45]
["2004-10-20",1.67]
["2004-10-21",4.95]
["2004-10-22",4.4800000000000004]
["2004-10-23",2.17]
["2004-10-24",2.2999999999999998]
["2004-10-25",4.3499999999999996]
["2004-10-26",6.3]
["2004-10-27",9]
["2004-10-28",4.05]
["2004-10-29",4.8499999999999996]
["2004-10-30",6.05]
["2004-10-31",7.65]
["2004-11-01",8]
["2004-11-02",6.65]
["2004-11-03",6.9]
["2004-11-04",7.1]
["2004-11-05",7.6]
["2004-11-06",8.3000000000000007]
["2004-11-07",7.05]
["2004-11-08",10.55]
["2004-11-09",10.15]
["2004-11-10",11]
["2004-11-11",10.45]
["2004-11-12",12.1]
["2004-11-13",10.75]
["2004-11-14",11.3]
["2004-11-15",12.1]
["2004-11-16",8.6999999999999993]
["2004-11-17",6.7]
["2004-11-18",7.5]
["2004-11-19",11.1]
["2004-11-20",12.95]
["2004-11-21",10.65]
["2004-11-22",6.35]
["2004-11-23",5.9]
["2004-11-24",8.4499999999999993]
["2004-11-25",14.45]
["2004-11-26",12.85]
["2004-11-27",8.3000000000000007]
["2004-11-28",11.15]
["2004-11-29",9.65]
["2004-11-30",10.7]
["2004-12-01",12.5]
["2004-12-02",12.85]
["2004-12-03",12.55]
["2004-12-04",14.15]
["2004-12-05",14.2]
["2004-12-06",11.15]
["2004-12-07",12.4]
["2004-12-08",14.4]
["2004-12-09",16]
["2004-12-10",15.8]
["2004-12-11",16.850000000000001]
["2004-12-12",19.05]
["2004-12-13",18.75]
["2004-12-14",16.95]
["2004-12-15",16.350000000000001]
["2004-12-16",13]
["2004-12-17",9]
["2004-12-18",10.9]
["2004-12-19",13.25]
["2004-12-20",17.399999999999999]
["2004-12-21",19.05]
["2004-12-22",13.6]
["2004-12-23",10.15]
["2004-12-24",7.7]
["2004-12-25",12.4]
["2004-12-26",14.7]
["2004-12-27",15.1]
["2004-12-28",13.65]
["2004-12-29",13]
["2004-12-30",10.65]
["2004-12-31",7.95]
["2005-01-01",8.4]
["2005-01-02",10.3]
["2005-01-03",11.25]
["2005-01-04",12.95]
["2005-01-05",10.6]
["2005-01-06",8.35]
["2005-01-07",7.5]
["2005-01-08",9.1999999999999993]
["2005-01-09",9.15]
["2005-01-10",8.5]
["2005-01-11",8.1]
["2005-01-12",8.0500000000000007]
["2005-01-13",10.9]
["2005-01-14",16.649999999999999]
["2005-01-15",16.75]
["2005-01-16",15.75]
["2005-01-17",11.75]
["2005-01-18",13.45]
["2005-01-19",10.5]
["2005-01-20",8.5500000000000007]
["2005-01-21",8.65]
["2005-01-22",12.4]
["2005-01-23",14.45]
["2005-01-24",15.35]
["2005-01-25",16.850000000000001]
["2005-01-26",18.5]
["2005-01-27",16.899999999999999]
["2005-01-28",15]
["2005-01-29",15.75]
["2005-01-30",13.95]
["2005-01-31",11.1]
["2005-02-01",10.7]
["2005-02-02",10.8]
["2005-02-03",10.95]
["2005-02-04",11.1]
["2005-02-05",15]
["2005-02-06",12.7]
["2005-02-07",12.65]
["2005-02-08",10.7]
["2005-02-09",10]
["2005-02-10",10.199999999999999]
["2005-02-11",7.55]
["2005-02-12",6.05]
["2005-02-13",13.6]
["2005-02-14",14]
["2005-02-15",15]
["2005-02-16",17.2]
["2005-02-17",16.5]
["2005-02-18",14.2]
["2005-02-19",13.4]
["2005-02-20",15.75]
["2005-02-21",15.1]
["2005-02-22",17.45]
["2005-02-23",18.5]
["2005-02-24",17.899999999999999]
["2005-02-25",18.3]
["2005-02-26",17.3]
["2005-02-27",17.899999999999999]
["2005-02-28",20.85]
["2005-03-01",20.05]
["2005-03-02",18.100000000000001]
["2005-03-03",18]
["2005-03-04",17.8]
["2005-03-05",16.7]
["2005-03-06",17.45]
["2005-03-07",15.1]
["2005-03-08",12.35]
["2005-03-09",11.8]
["2005-03-10",12.7]
["2005-03-11",11.6]
["2005-03-12",12]
["2005-03-13",13.35]
["2005-03-14",11.8]
["2005-03-15",8.25]
["2005-03-16",3.87]
["2005-03-17",2.4]
["2005-03-18",5.3]
["2005-03-19",5.95]
["2005-03-20",3.59]
["2005-03-21",4.59]
["2005-03-22",3.7]
["2005-03-23",5.14]
["2005-03-24",5.15]
["2005-03-25",5.33]
["2005-03-26",5.25]
["2005-03-27",4.6500000000000004]
["2005-03-28",5.3]
["2005-03-29",5.7]
["2005-03-30",5.6]
["2005-03-31",6.45]
["2005-04-01",4.8099999999999996]
["2005-04-02",4.3]
["2005-04-03",3.25]
["2005-04-04",4.55]
["2005-04-05",7.1]
["2005-04-06",7.25]
["2005-04-07",7.55]
["2005-04-08",12.3]
["2005-04-09",12.35]
["2005-04-10",8.4]
["2005-04-11",6.2]
["2005-04-12",6.25]
["2005-04-13",5.75]
["2005-04-14",7.2]
["2005-04-15",7.75]
["2005-04-16",8.5500000000000007]
["2005-04-17",6.35]
["2005-04-18",5.7]
["2005-04-19",8.1]
["2005-04-20",7.05]
["2005-04-21",6.5]
["2005-04-22",6.25]
["2005-04-23",3.47]
["2005-04-24",3.55]
["2005-04-25",4.45]
["2005-04-26",5.35]
["2005-04-27",5.05]
["2005-04-28",3.12]
["2005-04-29",1.62]
["2005-04-30",1.01]
["2005-05-01",0.62]
["2005-05-02",0.22]
["2005-05-03",1.78]
["2005-05-04",4]
["2005-05-05",6.05]
["2005-05-06",3.45]
["2005-05-07",4.5999999999999996]
["2005-05-08",6.85]
["2005-05-09",6.9]
["2005-05-10",7.45]
["2005-05-11",7.6]
["2005-05-12",4.95]
["2005-05-13",4.3]
["2005-05-14",5.65]
["2005-05-15",4.6500000000000004]
["2005-05-16",4.1500000000000004]
["2005-05-17",6.15]
["2005-05-18",6.9]
["2005-05-19",4.04]
["2005-05-20",1.22]
["2005-05-21",2.39]
["2005-05-22",3.38]
["2005-05-23",4.1399999999999997]
["2005-05-24",2.44]
["2005-05-25",1.71]
["2005-05-26",0.74]
["2005-05-27",0]
["2005-05-28",0]
["2005-05-29",1.36]
["2005-05-30",2.88]
["2005-05-31",2.99]
["2005-06-01",1.1599999999999999]
["2005-06-02",0.87]
["2005-06-03",0.59]
["2005-06-04",2.61]
["2005-06-05",3.6]
["2005-06-06",2.09]
["2005-06-07",5.45]
["2005-06-08",4.07]
["2005-06-09",2.97]
["2005-06-10",2]
["2005-06-11",3.22]
["2005-06-12",3.07]
["2005-06-13",1.95]
["2005-06-14",1.6]
["2005-06-15",2.11]
["2005-06-16",0.65]
["2005-06-17",0]
["2005-06-18",0]
["2005-06-19",0]
["2005-06-20",0]
["2005-06-21",0]
["2005-06-22",0.15]
["2005-06-23",0]
["2005-06-24",0.02]
["2005-06-25",0]
["2005-06-26",0]
["2005-06-27",0]
["2005-06-28",0]
["2005-06-29",0]
["2005-06-30",0.45]
["2005-07-01",1.51]
["2005-07-02",0.08]
["2005-07-03",0.01]
["2005-07-04",1.94]
["2005-07-05",1.99]
["2005-07-06",1.29]
["2005-07-07",3.25]
["2005-07-08",2.7]
["2005-07-09",1.03]
["2005-07-10",0.55000000000000004]
["2005-07-11",0]
["2005-07-12",0.04]
["2005-07-13",0.13]
["2005-07-14",0]
["2005-07-15",0]
["2005-07-16",0]
["2005-07-17",0.19]
["2005-07-18",0]
["2005-07-19",0.39]
["2005-07-20",0.53]
["2005-07-21",0.3]
["2005-07-22",0.57999999999999996]
["2005-07-23",0.38]
["2005-07-24",0.26]
["2005-07-25",0.22]
["2005-07-26",0.03]
["2005-07-27",0.03]
["2005-07-28",0]
["2005-07-29",0]
["2005-07-30",0.94]
["2005-07-31",0.89]
["2005-08-01",0.26]
["2005-08-02",0.59]
["2005-08-03",0.63]
["2005-08-04",0.79]
["2005-08-05",0.65]
["2005-08-06",0.66]
["2005-08-07",0.45]
["2005-08-08",1.88]
["2005-08-09",1.7]
["2005-08-10",0.63]
["2005-08-11",0.52]
["2005-08-12",0.33]
["2005-08-13",1.1299999999999999]
["2005-08-14",0.61]
["2005-08-15",1.55]
["2005-08-16",1.54]
["2005-08-17",0.3]
["2005-08-18",0.17]
["2005-08-19",0.06]
["2005-08-20",1.87]
["2005-08-21",1.0900000000000001]
["2005-08-22",0.6]
["2005-08-23",0.35]
["2005-08-24",1.63]
["2005-08-25",1.05]
["2005-08-26",2.15]
["2005-08-27",1.46]
["2005-08-28",1.25]
["2005-08-29",0.7]
["2005-08-30",0.31]
["2005-08-31",0]
["2005-09-01",0]
["2005-09-02",0.19]
["2005-09-03",0.1]
["2005-09-04",0]
["2005-09-05",0]
["2005-09-06",0.01]
["2005-09-07",0.17]
["2005-09-08",0.16]
["2005-09-09",0]
["2005-09-10",0.49]
["2005-09-11",1.1100000000000001]
["2005-09-12",0.19]
["2005-09-13",0.37]
["2005-09-14",0.14000000000000001]
["2005-09-15",0]
["2005-09-16",2.0499999999999998]
["2005-09-17",4.5999999999999996]
["2005-09-18",4.7699999999999996]
["2005-09-19",3.89]
["2005-09-20",3.34]
["2005-09-21",2.5099999999999998]
["2005-09-22",2.42]
["2005-09-23",2.59]
["2005-09-24",0.82]
["2005-09-25",1.0900000000000001]
["2005-09-26",2.19]
["2005-09-27",2.09]
["2005-09-28",3.4]
["2005-09-29",2.5]
["2005-09-30",4.25]
["2005-10-01",2.44]
["2005-10-02",5.7]
["2005-10-03",4.5]
["2005-10-04",5.5]
["2005-10-05",3.8]
["2005-10-06",3]
["2005-10-07",3.6]
["2005-10-08",1.93]
["2005-10-09",2.42]
["2005-10-10",1.99]
["2005-10-11",1.92]
["2005-10-12",0.39]
["2005-10-13",0.72]
["2005-10-14",1.2]
["2005-10-15",2.64]
["2005-10-16",3.26]
["2005-10-17",2.88]
["2005-10-18",5.8]
["2005-10-19",2.41]
["2005-10-20",3.9]
["2005-10-21",2.0099999999999998]
["2005-10-22",1.66]
["2005-10-23",4.55]
["2005-10-24",5]
["2005-10-25",1.43]
["2005-10-26",0.83]
["2005-10-27",1.61]
["2005-10-28",1.08]
["2005-10-29",0.8]
["2005-10-30",1.03]
["2005-10-31",0.68]
["2005-11-01",4.5]
["2005-11-02",4.45]
["2005-11-03",1.85]
["2005-11-04",5.3]
["2005-11-05",7.3]
["2005-11-06",7.2]
["2005-11-07",4.75]
["2005-11-08",5.45]
["2005-11-09",7.35]
["2005-11-10",8.9]
["2005-11-11",9.3000000000000007]
["2005-11-12",10.6]
["2005-11-13",8.35]
["2005-11-14",9.6999999999999993]
["2005-11-15",11.05]
["2005-11-16",9.5500000000000007]
["2005-11-17",12.3]
["2005-11-18",13.95]
["2005-11-19",16.05]
["2005-11-20",16.350000000000001]
["2005-11-21",14.85]
["2005-11-22",13.35]
["2005-11-23",16.100000000000001]
["2005-11-24",14.7]
["2005-11-25",15.9]
["2005-11-26",16.45]
["2005-11-27",14.2]
["2005-11-28",13.75]
["2005-11-29",14.6]
["2005-11-30",17.05]
["2005-12-01",14.7]
["2005-12-02",12.15]
["2005-12-03",9.6999999999999993]
["2005-12-04",8.65]
["2005-12-05",11.05]
["2005-12-06",12.8]
["2005-12-07",11.9]
["2005-12-08",10.8]
["2005-12-09",14]
["2005-12-10",14]
["2005-12-11",15.8]
["2005-12-12",13.25]
["2005-12-13",12.6]
["2005-12-14",11.7]
["2005-12-15",10.9]
["2005-12-16",8.5500000000000007]
["2005-12-17",14.4]
["2005-12-18",15.5]
["2005-12-19",14.3]
["2005-12-20",15.75]
["2005-12-21",16]
["2005-12-22",14.2]
["2005-12-23",11.1]
["2005-12-24",10.35]
["2005-12-25",11.55]
["2005-12-26",14.3]
["2005-12-27",19.100000000000001]
["2005-12-28",19.100000000000001]
["2005-12-29",18.899999999999999]
["2005-12-30",15.2]
["2005-12-31",13.05]
["2006-01-01",12.7]
["2006-01-02",12.65]
["2006-01-03",12.3]
["2006-01-04",14.95]
["2006-01-05",17.350000000000001]
["2006-01-06",16.850000000000001]
["2006-01-07",15.3]
["2006-01-08",14.1]
["2006-01-09",12.1]
["2006-01-10",15.7]
["2006-01-11",14]
["2006-01-12",12.4]
["2006-01-13",15.25]
["2006-01-14",13.25]
["2006-01-15",14.85]
["2006-01-16",13.1]
["2006-01-17",10.199999999999999]
["2006-01-18",8.65]
["2006-01-19",8.0500000000000007]
["2006-01-20",8.4499999999999993]
["2006-01-21",11.8]
["2006-01-22",12.75]
["2006-01-23",15.15]
["2006-01-24",18.55]
["2006-01-25",17.8]
["2006-01-26",16.350000000000001]
["2006-01-27",21.7]
["2006-01-28",19.149999999999999]
["2006-01-29",15.5]
["2006-01-30",16.3]
["2006-01-31",16.350000000000001]
["2006-02-01",15.45]
["2006-02-02",18.5]
["2006-02-03",19.100000000000001]
["2006-02-04",17.3]
["2006-02-05",13.9]
["2006-02-06",11.55]
["2006-02-07",11.85]
["2006-02-08",10.8]
["2006-02-09",13.3]
["2006-02-10",14.7]
["2006-02-11",15.25]
["2006-02-12",14.5]
["2006-02-13",12.6]
["2006-02-14",13]
["2006-02-15",9.25]
["2006-02-16",9.8000000000000007]
["2006-02-17",10.45]
["2006-02-18",11.55]
["2006-02-19",12]
["2006-02-20",11.7]
["2006-02-21",15.1]
["2006-02-22",13.4]
["2006-02-23",16.649999999999999]
["2006-02-24",14.7]
["2006-02-25",15.3]
["2006-02-26",17.8]
["2006-02-27",16]
["2006-02-28",14.35]
["2006-03-01",16.45]
["2006-03-02",15.65]
["2006-03-03",13.15]
["2006-03-04",15.55]
["2006-03-05",14.7]
["2006-03-06",13.3]
["2006-03-07",12.05]
["2006-03-08",10.1]
["2006-03-09",7.2]
["2006-03-10",10.95]
["2006-03-11",13.15]
["2006-03-12",17.600000000000001]
["2006-03-13",16.75]
["2006-03-14",14.4]
["2006-03-15",11.45]
["2006-03-16",15.05]
["2006-03-17",14.25]
["2006-03-18",12.85]
["2006-03-19",11.2]
["2006-03-20",10.75]
["2006-03-21",13.95]
["2006-03-22",14.05]
["2006-03-23",12.3]
["2006-03-24",6.05]
["2006-03-25",6.05]
["2006-03-26",2.23]
["2006-03-27",2.2999999999999998]
["2006-03-28",7.9]
["2006-03-29",7.15]
["2006-03-30",4.7]
["2006-03-31",3.75]
["2006-04-01",4.2]
["2006-04-02",5.2]
["2006-04-03",6.35]
["2006-04-04",9.4]
["2006-04-05",11.35]
["2006-04-06",10.45]
["2006-04-07",8.0500000000000007]
["2006-04-08",8.6]
["2006-04-09",9.5500000000000007]
["2006-04-10",10.45]
["2006-04-11",10.45]
["2006-04-12",7.45]
["2006-04-13",6.9]
["2006-04-14",3.95]
["2006-04-15",5.0999999999999996]
["2006-04-16",6.05]
["2006-04-17",5.35]
["2006-04-18",7.75]
["2006-04-19",5.7]
["2006-04-20",5.45]
["2006-04-21",2.76]
["2006-04-22",2.87]
["2006-04-23",3.34]
["2006-04-24",2.19]
["2006-04-25",2.84]
["2006-04-26",1.96]
["2006-04-27",4.9000000000000004]
["2006-04-28",5.9]
["2006-04-29",9.35]
["2006-04-30",9.1]
["2006-05-01",7.8]
["2006-05-02",3.57]
["2006-05-03",1.36]
["2006-05-04",0.54]
["2006-05-05",1.07]
["2006-05-06",1.74]
["2006-05-07",2.2599999999999998]
["2006-05-08",3.4]
["2006-05-09",7.15]
["2006-05-10",5.2]
["2006-05-11",2.58]
["2006-05-12",1.4]
["2006-05-13",1.72]
["2006-05-14",3.68]
["2006-05-15",1.61]
["2006-05-16",0.65]
["2006-05-17",1.28]
["2006-05-18",0.31]
["2006-05-19",3.4]
["2006-05-20",3.5]
["2006-05-21",2.12]
["2006-05-22",2.95]
["2006-05-23",5.95]
["2006-05-24",5.55]
["2006-05-25",3.5]
["2006-05-26",0.91]
["2006-05-27",0.41]
["2006-05-28",1.41]
["2006-05-29",3.7]
["2006-05-30",7.25]
["2006-05-31",7.3]
["2006-06-01",6.9]
["2006-06-02",5.41]
["2006-06-03",3.01]
["2006-06-04",2.89]
["2006-06-05",0.94]
["2006-06-06",3.63]
["2006-06-07",2.09]
["2006-06-08",1.04]
["2006-06-09",0.54]
["2006-06-10",0.45]
["2006-06-11",0.11]
["2006-06-12",0]
["2006-06-13",0]
["2006-06-14",0]
["2006-06-15",0.71]
["2006-06-16",1.28]
["2006-06-17",0.5]
["2006-06-18",0.01]
["2006-06-19",0]
["2006-06-20",0.09]
["2006-06-21",0.77]
["2006-06-22",1.97]
["2006-06-23",1.36]
["2006-06-24",0.59]
["2006-06-25",0.33]
["2006-06-26",0.34]
["2006-06-27",0.21]
["2006-06-28",0.65]
["2006-06-29",0.45]
["2006-06-30",7.0000000000000007E-2]
["2006-07-01",0]
["2006-07-02",0]
["2006-07-03",0]
["2006-07-04",0]
["2006-07-05",0.02]
["2006-07-06",0.01]
["2006-07-07",0.04]
["2006-07-08",0.21]
["2006-07-09",0]
["2006-07-10",0.02]
["2006-07-11",0]
["2006-07-12",0.41]
["2006-07-13",0.37]
["2006-07-14",0.19]
["2006-07-15",0.11]
["2006-07-16",0.01]
["2006-07-17",0]
["2006-07-18",0]
["2006-07-19",0]
["2006-07-20",0]
["2006-07-21",0]
["2006-07-22",0]
["2006-07-23",0]
["2006-07-24",0]
["2006-07-25",0]
["2006-07-26",0]
["2006-07-27",0]
["2006-07-28",0]
["2006-07-29",0.02]
["2006-07-30",0]
["2006-07-31",0.18]
["2006-08-01",0.24]
["2006-08-02",0.9]
["2006-08-03",1.08]
["2006-08-04",0.44]
["2006-08-05",0.56000000000000005]
["2006-08-06",0.42]
["2006-08-07",0.01]
["2006-08-08",0.15]
["2006-08-09",0.39]
["2006-08-10",1.1499999999999999]
["2006-08-11",1.1399999999999999]
["2006-08-12",2.37]
["2006-08-13",3.1]
["2006-08-14",1.74]
["2006-08-15",0.83]
["2006-08-16",1.02]
["2006-08-17",0.39]
["2006-08-18",0.78]
["2006-08-19",1.27]
["2006-08-20",0.89]
["2006-08-21",1.39]
["2006-08-22",1.45]
["2006-08-23",0.82]
["2006-08-24",1.01]
["2006-08-25",1.71]
["2006-08-26",1.24]
["2006-08-27",1.1200000000000001]
["2006-08-28",1.55]
["2006-08-29",4.05]
["2006-08-30",2.69]
["2006-08-31",1.75]
["2006-09-01",1.02]
["2006-09-02",0.06]
["2006-09-03",0]
["2006-09-04",0]
["2006-09-05",0.17]
["2006-09-06",0.04]
["2006-09-07",7.0000000000000007E-2]
["2006-09-08",2.06]
["2006-09-09",1.72]
["2006-09-10",0.65]
["2006-09-11",0.4]
["2006-09-12",0.09]
["2006-09-13",0.16]
["2006-09-14",0]
["2006-09-15",0.28000000000000003]
["2006-09-16",0.21]
["2006-09-17",0.15]
["2006-09-18",0.6]
["2006-09-19",1.07]
["2006-09-20",2.25]
["2006-09-21",0.93]
["2006-09-22",0.23]
["2006-09-23",0.38]
["2006-09-24",0.55000000000000004]
["2006-09-25",0.96]
["2006-09-26",1.35]
["2006-09-27",1.86]
["2006-09-28",1.57]
["2006-09-29",0.89]
["2006-09-30",1.99]
["2006-10-01",1.31]
["2006-10-02",2.5]
["2006-10-03",3.9]
["2006-10-04",4.1500000000000004]
["2006-10-05",4.6500000000000004]
["2006-10-06",1.38]
["2006-10-07",3.55]
["2006-10-08",5]
["2006-10-09",3.28]
["2006-10-10",1.6]
["2006-10-11",1.5]
["2006-10-12",1.55]
["2006-10-13",3.33]
["2006-10-14",1.02]
["2006-10-15",3.5]
["2006-10-16",3.01]
["2006-10-17",3.88]
["2006-10-18",2.65]
["2006-10-19",2.23]
["2006-10-20",2.65]
["2006-10-21",2.95]
["2006-10-22",1.96]
["2006-10-23",0.56000000000000005]
["2006-10-24",3.6]
["2006-10-25",4.25]
["2006-10-26",0.47]
["2006-10-27",1.82]
["2006-10-28",2.69]
["2006-10-29",1.07]
["2006-10-30",4.95]
["2006-10-31",5.8]
["2006-11-01",8.85]
["2006-11-02",10.8]
["2006-11-03",10.6]
["2006-11-04",10.4]
["2006-11-05",14]
["2006-11-06",13.15]
["2006-11-07",12.9]
["2006-11-08",9.75]
["2006-11-09",5.95]
["2006-11-10",10.65]
["2006-11-11",8.4]
["2006-11-12",6.95]
["2006-11-13",6.15]
["2006-11-14",2.9]
["2006-11-15",3.85]
["2006-11-16",3.5]
["2006-11-17",6.55]
["2006-11-18",7.95]
["2006-11-19",9.4499999999999993]
["2006-11-20",9.4]
["2006-11-21",9.15]
["2006-11-22",9.25]
["2006-11-23",6.8]
["2006-11-24",4.55]
["2006-11-25",2.41]
["2006-11-26",5.25]
["2006-11-27",5.9]
["2006-11-28",7]
["2006-11-29",8.3000000000000007]
["2006-11-30",12.1]
["2006-12-01",10.6]
["2006-12-02",7.75]
["2006-12-03",8.25]
["2006-12-04",6.4]
["2006-12-05",4.45]
["2006-12-06",8.3000000000000007]
["2006-12-07",9.4499999999999993]
["2006-12-08",8.15]
["2006-12-09",11.05]
["2006-12-10",11.75]
["2006-12-11",11.9]
["2006-12-12",12.05]
["2006-12-13",9.65]
["2006-12-14",12.1]
["2006-12-15",13.1]
["2006-12-16",11.8]
["2006-12-17",13.5]
["2006-12-18",13.25]
["2006-12-19",15.15]
["2006-12-20",14.9]
["2006-12-21",12.9]
["2006-12-22",12.75]
["2006-12-23",14.9]
["2006-12-24",15.8]
["2006-12-25",16.649999999999999]
["2006-12-26",17.850000000000001]
["2006-12-27",17.45]
["2006-12-28",18.7]
["2006-12-29",14.9]
["2006-12-30",8.85]
["2006-12-31",7.3]
["2007-01-01",8.35]
["2007-01-02",10.95]
["2007-01-03",11.05]
["2007-01-04",8.5500000000000007]
["2007-01-05",7.65]
["2007-01-06",6.25]
["2007-01-07",9.75]
["2007-01-08",6.5]
["2007-01-09",5.2]
["2007-01-10",6.85]
["2007-01-11",9.8000000000000007]
["2007-01-12",7.9]
["2007-01-13",6.9]
["2007-01-14",9.0500000000000007]
["2007-01-15",12.55]
["2007-01-16",9.4499999999999993]
["2007-01-17",6.45]
["2007-01-18",4.45]
["2007-01-19",4]
["2007-01-20",5.7]
["2007-01-21",9.5500000000000007]
["2007-01-22",12.55]
["2007-01-23",16.3]
["2007-01-24",16.2]
["2007-01-25",19]
["2007-01-26",17.3]
["2007-01-27",12.75]
["2007-01-28",13.5]
["2007-01-29",10.199999999999999]
["2007-01-30",10.199999999999999]
["2007-01-31",9.4499999999999993]
["2007-02-01",9.1999999999999993]
["2007-02-02",7.65]
["2007-02-03",10.55]
["2007-02-04",10.85]
["2007-02-05",12.4]
["2007-02-06",11.75]
["2007-02-07",14.8]
["2007-02-08",11.45]
["2007-02-09",11.15]
["2007-02-10",8.8000000000000007]
["2007-02-11",6.9]
["2007-02-12",7.8]
["2007-02-13",8.5500000000000007]
["2007-02-14",9.0500000000000007]
["2007-02-15",11.25]
["2007-02-16",9.9]
["2007-02-17",5.51]
["2007-02-18",5.45]
["2007-02-19",10.199999999999999]
["2007-02-20",8.75]
["2007-02-21",6.55]
["2007-02-22",9.3000000000000007]
["2007-02-23",8.5]
["2007-02-24",6.45]
["2007-02-25",9.8000000000000007]
["2007-02-26",8.1]
["2007-02-27",8.35]
["2007-02-28",6.15]
["2007-03-01",6.8]
["2007-03-02",9]
["2007-03-03",6.95]
["2007-03-04",7.3]
["2007-03-05",7.45]
["2007-03-06",8.25]
["2007-03-07",8.4499999999999993]
["2007-03-08",8.25]
["2007-03-09",7.9]
["2007-03-10",8.6]
["2007-03-11",8.1999999999999993]
["2007-03-12",7.75]
["2007-03-13",8.0500000000000007]
["2007-03-14",7.35]
["2007-03-15",7.65]
["2007-03-16",8.9]
["2007-03-17",8.1999999999999993]
["2007-03-18",8.5500000000000007]
["2007-03-19",13.5]
["2007-03-20",13.15]
["2007-03-21",12.75]
["2007-03-22",11.15]
["2007-03-23",13.9]
["2007-03-24",12.95]
["2007-03-25",9.65]
["2007-03-26",8.0500000000000007]
["2007-03-27",5.9]
["2007-03-28",5.44]
["2007-03-29",8.0500000000000007]
["2007-03-30",12.6]
["2007-03-31",12.15]
["2007-04-01",6.15]
["2007-04-02",3.79]
["2007-04-03",6.9]
["2007-04-04",9.75]
["2007-04-05",7.35]
["2007-04-06",4.59]
["2007-04-07",6.7]
["2007-04-08",6.1]
["2007-04-09",4.42]
["2007-04-10",4.04]
["2007-04-11",3.15]
["2007-04-12",2.46]
["2007-04-13",0.71]
["2007-04-14",0.55000000000000004]
["2007-04-15",0.65]
["2007-04-16",0.93]
["2007-04-17",2.54]
["2007-04-18",4.95]
["2007-04-19",4.38]
["2007-04-20",3.44]
["2007-04-21",3.75]
["2007-04-22",2.5]
["2007-04-23",1.57]
["2007-04-24",1.2]
["2007-04-25",0.73]
["2007-04-26",1.1599999999999999]
["2007-04-27",0.86]
["2007-04-28",0.57999999999999996]
["2007-04-29",0.43]
["2007-04-30",1.1499999999999999]
["2007-05-01",1.47]
["2007-05-02",2.0099999999999998]
["2007-05-03",2.5099999999999998]
["2007-05-04",2.89]
["2007-05-05",4.4000000000000004]
["2007-05-06",4.68]
["2007-05-07",1.9]
["2007-05-08",2.23]
["2007-05-09",1.1399999999999999]
["2007-05-10",1.37]
["2007-05-11",2.66]
["2007-05-12",1.94]
["2007-05-13",1.66]
["2007-05-14",2.5299999999999998]
["2007-05-15",5.05]
["2007-05-16",3.26]
["2007-05-17",3.2]
["2007-05-18",0.59]
["2007-05-19",1.41]
["2007-05-20",5.2]
["2007-05-21",1.32]
["2007-05-22",0.78]
["2007-05-23",1.19]
["2007-05-24",0.77]
["2007-05-25",0.26]
["2007-05-26",0.82]
["2007-05-27",5.95]
["2007-05-28",5.55]
["2007-05-29",5.8]
["2007-05-30",4.95]
["2007-05-31",3.34]
["2007-06-01",3.94]
["2007-06-02",1.77]
["2007-06-03",0.83]
["2007-06-04",0.22]
["2007-06-05",0.55000000000000004]
["2007-06-06",0.46]
["2007-06-07",0.72]
["2007-06-08",0.11]
["2007-06-09",0.18]
["2007-06-10",0.38]
["2007-06-11",0.17]
["2007-06-12",0.71]
["2007-06-13",0.37]
["2007-06-14",0.32]
["2007-06-15",0.74]
["2007-06-16",1.07]
["2007-06-17",1.91]
["2007-06-18",0.74]
["2007-06-19",0.03]
["2007-06-20",0.6]
["2007-06-21",0.43]
["2007-06-22",1.35]
["2007-06-23",0.82]
["2007-06-24",1.1399999999999999]
["2007-06-25",1.34]
["2007-06-26",3.1]
["2007-06-27",2.85]
["2007-06-28",2.2200000000000002]
["2007-06-29",1.73]
["2007-06-30",0.6]
["2007-07-01",0.14000000000000001]
["2007-07-02",0.77]
["2007-07-03",1.4]
["2007-07-04",2.2200000000000002]
["2007-07-05",1.58]
["2007-07-06",0.95]
["2007-07-07",0.96]
["2007-07-08",1.1499999999999999]
["2007-07-09",3.25]
["2007-07-10",3.06]
["2007-07-11",1.65]
["2007-07-12",1.64]
["2007-07-13",0.34]
["2007-07-14",0]
["2007-07-15",0]
["2007-07-16",0]
["2007-07-17",0.92]
["2007-07-18",0.15]
["2007-07-19",0.21]
["2007-07-20",0]
["2007-07-21",1.05]
["2007-07-22",1.6]
["2007-07-23",0.94]
["2007-07-24",0.74]
["2007-07-25",1.1100000000000001]
["2007-07-26",0.67]
["2007-07-27",0.44]
["2007-07-28",0.03]
["2007-07-29",0.44]
["2007-07-30",1.69]
["2007-07-31",2.06]
["2007-08-01",1.1299999999999999]
["2007-08-02",0.5]
["2007-08-03",0.68]
["2007-08-04",0.47]
["2007-08-05",7.0000000000000007E-2]
["2007-08-06",0.26]
["2007-08-07",1.18]
["2007-08-08",2.46]
["2007-08-09",2.36]
["2007-08-10",2.15]
["2007-08-11",0.5]
["2007-08-12",0.61]
["2007-08-13",1.08]
["2007-08-14",0.9]
["2007-08-15",0]
["2007-08-16",0.94]
["2007-08-17",1.81]
["2007-08-18",2.15]
["2007-08-19",1.22]
["2007-08-20",2.2200000000000002]
["2007-08-21",1.76]
["2007-08-22",0.79]
["2007-08-23",0.68]
["2007-08-24",0.25]
["2007-08-25",0.55000000000000004]
["2007-08-26",0.37]
["2007-08-27",1.01]
["2007-08-28",1.84]
["2007-08-29",2.0699999999999998]
["2007-08-30",2.5499999999999998]
["2007-08-31",0.46]
["2007-09-01",0.55000000000000004]
["2007-09-02",0.6]
["2007-09-03",1.55]
["2007-09-04",3.21]
["2007-09-05",3.46]
["2007-09-06",0.55000000000000004]
["2007-09-07",0.48]
["2007-09-08",0.94]
["2007-09-09",0.79]
["2007-09-10",2.42]
["2007-09-11",2.94]
["2007-09-12",2.77]
["2007-09-13",2.25]
["2007-09-14",1.7]
["2007-09-15",0.75]
["2007-09-16",1.29]
["2007-09-17",1.88]
["2007-09-18",4.75]
["2007-09-19",5.95]
["2007-09-20",4.46]
["2007-09-21",3.6]
["2007-09-22",2.2400000000000002]
["2007-09-23",1.34]
["2007-09-24",2.16]
["2007-09-25",4.3499999999999996]
["2007-09-26",5.4]
["2007-09-27",5.6]
["2007-09-28",4.8]
["2007-09-29",3.55]
["2007-09-30",4.75]
["2007-10-01",1.01]
["2007-10-02",0.33]
["2007-10-03",0.4]
["2007-10-04",2.15]
["2007-10-05",3.15]
["2007-10-06",3.45]
["2007-10-07",4.07]
["2007-10-08",4]
["2007-10-09",3.37]
["2007-10-10",4.5]
["2007-10-11",4.45]
["2007-10-12",4.25]
["2007-10-13",3.4]
["2007-10-14",4.38]
["2007-10-15",5.45]
["2007-10-16",3.72]
["2007-10-17",4.3]
["2007-10-18",6.35]
["2007-10-19",8.0500000000000007]
["2007-10-20",9.3000000000000007]
["2007-10-21",10.25]
["2007-10-22",8.3000000000000007]
["2007-10-23",11.25]
["2007-10-24",11.3]
["2007-10-25",9.6]
["2007-10-26",8.0500000000000007]
["2007-10-27",7.85]
["2007-10-28",9.4499999999999993]
["2007-10-29",8.25]
["2007-10-30",8.3000000000000007]
["2007-10-31",8.65]
["2007-11-01",7.9]
["2007-11-02",5.3]
["2007-11-03",4.45]
["2007-11-04",5.85]
["2007-11-05",7.85]
["2007-11-06",8.1]
["2007-11-07",9.1]
["2007-11-08",6.2]
["2007-11-09",10.45]
["2007-11-10",9.1999999999999993]
["2007-11-11",6.2]
["2007-11-12",11.15]
["2007-11-13",11.95]
["2007-11-14",10.7]
["2007-11-15",14.2]
["2007-11-16",15.65]
["2007-11-17",14.6]
["2007-11-18",16.05]
["2007-11-19",12.7]
["2007-11-20",8.15]
["2007-11-21",6.4]
["2007-11-22",8.3000000000000007]
["2007-11-23",9.9]
["2007-11-24",12.65]
["2007-11-25",10.35]
["2007-11-26",9.4499999999999993]
["2007-11-27",10]
["2007-11-28",14.75]
["2007-11-29",13]
["2007-11-30",10.7]
["2007-12-01",8.6]
["2007-12-02",8.25]
["2007-12-03",8.3000000000000007]
["2007-12-04",8.85]
["2007-12-05",6.25]
["2007-12-06",6.5]
["2007-12-07",7.2]
["2007-12-08",10.15]
["2007-12-09",9.0500000000000007]
["2007-12-10",9.9]
["2007-12-11",12.1]
["2007-12-12",13.4]
["2007-12-13",14.5]
["2007-12-14",16.7]
["2007-12-15",16.600000000000001]
["2007-12-16",18.25]
["2007-12-17",18.05]
["2007-12-18",18.75]
["2007-12-19",19.350000000000001]
["2007-12-20",18.2]
["2007-12-21",16.399999999999999]
["2007-12-22",15.2]
["2007-12-23",14.35]
["2007-12-24",15.85]
["2007-12-25",15.8]
["2007-12-26",15]
["2007-12-27",13.1]
["2007-12-28",12.3]
["2007-12-29",10.85]
["2007-12-30",10.9]
["2007-12-31",11.2]
["2008-01-01",13.05]
["2008-01-02",16.600000000000001]
["2008-01-03",15.65]
["2008-01-04",10.75]
["2008-01-05",10.15]
["2008-01-06",9.3000000000000007]
["2008-01-07",8.65]
["2008-01-08",11.5]
["2008-01-09",10.1]
["2008-01-10",10.35]
["2008-01-11",8.15]
["2008-01-12",10.8]
["2008-01-13",10.9]
["2008-01-14",10.25]
["2008-01-15",9.4499999999999993]
["2008-01-16",10.7]
["2008-01-17",9.4]
["2008-01-18",7.6]
["2008-01-19",4.55]
["2008-01-20",5.45]
["2008-01-21",7.35]
["2008-01-22",10.3]
["2008-01-23",10.75]
["2008-01-24",8.9499999999999993]
["2008-01-25",11.25]
["2008-01-26",12.45]
["2008-01-27",12.8]
["2008-01-28",13.15]
["2008-01-29",14.6]
["2008-01-30",14.35]
["2008-01-31",14.2]
["2008-02-01",12.45]
["2008-02-02",13.25]
["2008-02-03",13.6]
["2008-02-04",11.15]
["2008-02-05",10.15]
["2008-02-06",7.05]
["2008-02-07",10.7]
["2008-02-08",10.7]
["2008-02-09",9.6]
["2008-02-10",10.7]
["2008-02-11",10.45]
["2008-02-12",10.55]
["2008-02-13",10.25]
["2008-02-14",14.15]
["2008-02-15",16.7]
["2008-02-16",15.3]
["2008-02-17",14.4]
["2008-02-18",12.45]
["2008-02-19",11.85]
["2008-02-20",9.8000000000000007]
["2008-02-21",9]
["2008-02-22",7.15]
["2008-02-23",7.1]
["2008-02-24",7.9]
["2008-02-25",6.55]
["2008-02-26",7.7]
["2008-02-27",9.35]
["2008-02-28",7.95]
["2008-02-29",6.55]
["2008-03-01",5.3]
["2008-03-02",5.9]
["2008-03-03",9.15]
["2008-03-04",12.65]
["2008-03-05",13.65]
["2008-03-06",13.05]
["2008-03-07",9.1999999999999993]
["2008-03-08",10.25]
["2008-03-09",9.4]
["2008-03-10",10.8]
["2008-03-11",7.6]
["2008-03-12",7.8]
["2008-03-13",8.85]
["2008-03-14",6.15]
["2008-03-15",5.6]
["2008-03-16",6.3]
["2008-03-17",10.4]
["2008-03-18",12.6]
["2008-03-19",11.5]
["2008-03-20",12]
["2008-03-21",10.65]
["2008-03-22",12.2]
["2008-03-23",14.4]
["2008-03-24",13.95]
["2008-03-25",13.6]
["2008-03-26",10.3]
["2008-03-27",10.1]
["2008-03-28",11.65]
["2008-03-29",8.9]
["2008-03-30",8.15]
["2008-03-31",8.1999999999999993]
["2008-04-01",7.7]
["2008-04-02",7.05]
["2008-04-03",5.65]
["2008-04-04",7.6]
["2008-04-05",8.1]
["2008-04-06",11.95]
["2008-04-07",13.1]
["2008-04-08",12.45]
["2008-04-09",10.45]
["2008-04-10",8.9499999999999993]
["2008-04-11",7.6]
["2008-04-12",8.1999999999999993]
["2008-04-13",7.15]
["2008-04-14",9.4499999999999993]
["2008-04-15",8.9499999999999993]
["2008-04-16",9.3000000000000007]
["2008-04-17",9.75]
["2008-04-18",7]
["2008-04-19",4.55]
["2008-04-20",4.5999999999999996]
["2008-04-21",4.7]
["2008-04-22",3.94]
["2008-04-23",4.9000000000000004]
["2008-04-24",5.46]
["2008-04-25",4.5]
["2008-04-26",3.26]
["2008-04-27",1.92]
["2008-04-28",5.15]
["2008-04-29",8.1]
["2008-04-30",6.55]
["2008-05-01",7.2]
["2008-05-02",5.22]
["2008-05-03",2.04]
["2008-05-04",1.42]
["2008-05-05",1.24]
["2008-05-06",1.63]
["2008-05-07",1.02]
["2008-05-08",0.94]
["2008-05-09",0.61]
["2008-05-10",0.17]
["2008-05-11",0.24]
["2008-05-12",0.62]
["2008-05-13",0.46]
["2008-05-14",0.12]
["2008-05-15",1.21]
["2008-05-16",1.75]
["2008-05-17",1.94]
["2008-05-18",3.3]
["2008-05-19",5.05]
["2008-05-20",3.96]
["2008-05-21",3.3]
["2008-05-22",1.04]
["2008-05-23",1.46]
["2008-05-24",0.25]
["2008-05-25",1.2]
["2008-05-26",0.81]
["2008-05-27",2.56]
["2008-05-28",0.94]
["2008-05-29",0.67]
["2008-05-30",0.52]
["2008-05-31",1.22]
["2008-06-01",1.1399999999999999]
["2008-06-02",0.39]
["2008-06-03",2.0499999999999998]
["2008-06-04",2.44]
["2008-06-05",1.57]
["2008-06-06",2.8]
["2008-06-07",2.77]
["2008-06-08",2.1800000000000002]
["2008-06-09",0.54]
["2008-06-10",0.21]
["2008-06-11",0.65]
["2008-06-12",2.85]
["2008-06-13",4.0999999999999996]
["2008-06-14",2.61]
["2008-06-15",3.16]
["2008-06-16",1.98]
["2008-06-17",2.08]
["2008-06-18",1.21]
["2008-06-19",1.22]
["2008-06-20",0.47]
["2008-06-21",0.22]
["2008-06-22",0]
["2008-06-23",1.23]
["2008-06-24",0.3]
["2008-06-25",0]
["2008-06-26",0.68]
["2008-06-27",1.06]
["2008-06-28",0]
["2008-06-29",0.04]
["2008-06-30",0.61]
["2008-07-01",0.32]
["2008-07-02",0]
["2008-07-03",0.62]
["2008-07-04",2.34]
["2008-07-05",0.13]
["2008-07-06",1.58]
["2008-07-07",1.48]
["2008-07-08",1.73]
["2008-07-09",1.32]
["2008-07-10",0.45]
["2008-07-11",0.23]
["2008-07-12",1.32]
["2008-07-13",2.09]
["2008-07-14",1.58]
["2008-07-15",0.56999999999999995]
["2008-07-16",0.14000000000000001]
["2008-07-17",0.71]
["2008-07-18",0.67]
["2008-07-19",0.12]
["2008-07-20",1.83]
["2008-07-21",2]
["2008-07-22",1.44]
["2008-07-23",0.66]
["2008-07-24",0.21]
["2008-07-25",0]
["2008-07-26",0.24]
["2008-07-27",0]
["2008-07-28",0]
["2008-07-29",0.06]
["2008-07-30",0.06]
["2008-07-31",0]
["2008-08-01",0.17]
["2008-08-02",0.56000000000000005]
["2008-08-03",7.0000000000000007E-2]
["2008-08-04",0.06]
["2008-08-05",0.03]
["2008-08-06",0.06]
["2008-08-07",7.0000000000000007E-2]
["2008-08-08",0.39]
["2008-08-09",0.87]
["2008-08-10",0.36]
["2008-08-11",0.72]
["2008-08-12",0.4]
["2008-08-13",0.72]
["2008-08-14",2.02]
["2008-08-15",0.97]
["2008-08-16",1.17]
["2008-08-17",0.48]
["2008-08-18",0.75]
["2008-08-19",0.51]
["2008-08-20",0.64]
["2008-08-21",1.1599999999999999]
["2008-08-22",1.45]
["2008-08-23",1.97]
["2008-08-24",2.67]
["2008-08-25",1.1399999999999999]
["2008-08-26",0.56000000000000005]
["2008-08-27",0.83]
["2008-08-28",0.28999999999999998]
["2008-08-29",0.16]
["2008-08-30",0.6]
["2008-08-31",0]
["2008-09-01",0.31]
["2008-09-02",0.75]
["2008-09-03",3.15]
["2008-09-04",3.27]
["2008-09-05",1.49]
["2008-09-06",0.89]
["2008-09-07",1.5]
["2008-09-08",2.1800000000000002]
["2008-09-09",1.6]
["2008-09-10",0.25]
["2008-09-11",0.3]
["2008-09-12",1.91]
["2008-09-13",3.33]
["2008-09-14",2.2999999999999998]
["2008-09-15",4.5999999999999996]
["2008-09-16",4.5999999999999996]
["2008-09-17",5.25]
["2008-09-18",6.05]
["2008-09-19",4.8099999999999996]
["2008-09-20",4.07]
["2008-09-21",4.58]
["2008-09-22",4.1500000000000004]
["2008-09-23",5.05]
["2008-09-24",2.44]
["2008-09-25",2.11]
["2008-09-26",3.74]
["2008-09-27",3.6]
["2008-09-28",3.51]
["2008-09-29",4.3499999999999996]
["2008-09-30",5.8]
["2008-10-01",2.3199999999999998]
["2008-10-02",6.35]
["2008-10-03",9.1999999999999993]
["2008-10-04",8]
["2008-10-05",4.5999999999999996]
["2008-10-06",1.8]
["2008-10-07",1.23]
["2008-10-08",3.8]
["2008-10-09",4.75]
["2008-10-10",4.62]
["2008-10-11",4.5]
["2008-10-12",2.92]
["2008-10-13",1.24]
["2008-10-14",1.75]
["2008-10-15",2.6]
["2008-10-16",4.75]
["2008-10-17",7.35]
["2008-10-18",7.65]
["2008-10-19",7.75]
["2008-10-20",5.09]
["2008-10-21",6.8]
["2008-10-22",6.85]
["2008-10-23",8.6999999999999993]
["2008-10-24",7.95]
["2008-10-25",7.1]
["2008-10-26",6.8]
["2008-10-27",6.85]
["2008-10-28",9.8000000000000007]
["2008-10-29",14.5]
["2008-10-30",13.4]
["2008-10-31",11.85]
["2008-11-01",9.1999999999999993]
["2008-11-02",7.95]
["2008-11-03",5]
["2008-11-04",6.4]
["2008-11-05",9.1]
["2008-11-06",8.6]
["2008-11-07",7.75]
["2008-11-08",9.25]
["2008-11-09",6.3]
["2008-11-10",5.05]
["2008-11-11",7.2]
["2008-11-12",9.4499999999999993]
["2008-11-13",9.35]
["2008-11-14",9.4]
["2008-11-15",6.75]
["2008-11-16",5.75]
["2008-11-17",9.1]
["2008-11-18",8.75]
["2008-11-19",9.0500000000000007]
["2008-11-20",7.05]
["2008-11-21",7.85]
["2008-11-22",12.35]
["2008-11-23",14.15]
["2008-11-24",12.75]
["2008-11-25",14.25]
["2008-11-26",12.1]
["2008-11-27",14.9]
["2008-11-28",15.85]
["2008-11-29",14.3]
["2008-11-30",14.9]
["2008-12-01",13.35]
["2008-12-02",13.9]
["2008-12-03",12.5]
["2008-12-04",12.9]
["2008-12-05",10.8]
["2008-12-06",10.65]
["2008-12-07",14.2]
["2008-12-08",16.05]
["2008-12-09",15.75]
["2008-12-10",14.5]
["2008-12-11",15.95]
["2008-12-12",18.3]
["2008-12-13",16.95]
["2008-12-14",14.1]
["2008-12-15",15.85]
["2008-12-16",16.899999999999999]
["2008-12-17",15.05]
["2008-12-18",12.05]
["2008-12-19",10]
["2008-12-20",9]
["2008-12-21",7.95]
["2008-12-22",8.25]
["2008-12-23",9.15]
["2008-12-24",13.2]
["2008-12-25",12.15]
["2008-12-26",16.149999999999999]
["2008-12-27",17.649999999999999]
["2008-12-28",18.95]
["2008-12-29",18.95]
["2008-12-30",18.3]
["2008-12-31",16.149999999999999]
["2009-01-01",17.399999999999999]
["2009-01-02",18.399999999999999]
["2009-01-03",17.850000000000001]
["2009-01-04",19.850000000000001]
["2009-01-05",18.399999999999999]
["2009-01-06",23.4]
["2009-01-07",21.9]
["2009-01-08",17.899999999999999]
["2009-01-09",21.35]
["2009-01-10",20.149999999999999]
["2009-01-11",19.350000000000001]
["2009-01-12",16.05]
["2009-01-13",13.45]
["2009-01-14",13.9]
["2009-01-15",14.5]
["2009-01-16",15.05]
["2009-01-17",11.15]
["2009-01-18",10.6]
["2009-01-19",9.5500000000000007]
["2009-01-20",13.9]
["2009-01-21",15.4]
["2009-01-22",11]
["2009-01-23",8.9]
["2009-01-24",13.15]
["2009-01-25",13.55]
["2009-01-26",13.8]
["2009-01-27",13.55]
["2009-01-28",15.05]
["2009-01-29",16.850000000000001]
["2009-01-30",15.85]
["2009-01-31",15.55]
["2009-02-01",17.899999999999999]
["2009-02-02",15.95]
["2009-02-03",17.8]
["2009-02-04",16.75]
["2009-02-05",12]
["2009-02-06",10.7]
["2009-02-07",15.3]
["2009-02-08",14.65]
["2009-02-09",11.6]
["2009-02-10",12.6]
["2009-02-11",13.9]
["2009-02-12",14.7]
["2009-02-13",16.2]
["2009-02-14",15.15]
["2009-02-15",15.2]
["2009-02-16",11.45]
["2009-02-17",9.8000000000000007]
["2009-02-18",12.35]
["2009-02-19",14.45]
["2009-02-20",10.25]
["2009-02-21",10.75]
["2009-02-22",10.4]
["2009-02-23",10.3]
["2009-02-24",11.3]
["2009-02-25",11.45]
["2009-02-26",11.6]
["2009-02-27",11.75]
["2009-02-28",9.4]
["2009-03-01",8.35]
["2009-03-02",8.4499999999999993]
["2009-03-03",11]
["2009-03-04",12.55]
["2009-03-05",15.25]
["2009-03-06",11.85]
["2009-03-07",11.65]
["2009-03-08",8.9499999999999993]
["2009-03-09",10.65]
["2009-03-10",8.65]
["2009-03-11",9.6999999999999993]
["2009-03-12",8.25]
["2009-03-13",7.4]
["2009-03-14",8.75]
["2009-03-15",7.9]
["2009-03-16",7.4]
["2009-03-17",6.35]
["2009-03-18",6.15]
["2009-03-19",6.9]
["2009-03-20",9.5]
["2009-03-21",10.35]
["2009-03-22",10.3]
["2009-03-23",7.95]
["2009-03-24",11.4]
["2009-03-25",10]
["2009-03-26",9.5]
["2009-03-27",8.8000000000000007]
["2009-03-28",9.9]
["2009-03-29",10.7]
["2009-03-30",10.25]
["2009-03-31",8.4]
["2009-04-01",6.7]
["2009-04-02",4.63]
["2009-04-03",4.3099999999999996]
["2009-04-04",6.8]
["2009-04-05",5.45]
["2009-04-06",3.13]
["2009-04-07",4.55]
["2009-04-08",7.75]
["2009-04-09",2.2999999999999998]
["2009-04-10",2.14]
["2009-04-11",2.85]
["2009-04-12",2.84]
["2009-04-13",3.84]
["2009-04-14",2.25]
["2009-04-15",1.64]
["2009-04-16",5.55]
["2009-04-17",5.2]
["2009-04-18",7.8]
["2009-04-19",4.3499999999999996]
["2009-04-20",3.32]
["2009-04-21",3.68]
["2009-04-22",3.8]
["2009-04-23",4.37]
["2009-04-24",4.53]
["2009-04-25",6.3]
["2009-04-26",5.85]
["2009-04-27",5.45]
["2009-04-28",8.35]
["2009-04-29",6.15]
["2009-04-30",5.25]
["2009-05-01",3.16]
["2009-05-02",4.41]
["2009-05-03",5.9]
["2009-05-04",6.2]
["2009-05-05",5.4]
["2009-05-06",4.6500000000000004]
["2009-05-07",3.35]
["2009-05-08",2.52]
["2009-05-09",4.05]
["2009-05-10",2.59]
["2009-05-11",3.2]
["2009-05-12",2.3199999999999998]
["2009-05-13",1.29]
["2009-05-14",2.1800000000000002]
["2009-05-15",4.1500000000000004]
["2009-05-16",5.25]
["2009-05-17",4.7]
["2009-05-18",4.4000000000000004]
["2009-05-19",3.81]
["2009-05-20",2.66]
["2009-05-21",0.96]
["2009-05-22",2.66]
["2009-05-23",2.06]
["2009-05-24",0.38]
["2009-05-25",0]
["2009-05-26",2.25]
["2009-05-27",5.55]
["2009-05-28",2.12]
["2009-05-29",1.45]
["2009-05-30",1.56]
["2009-05-31",1.08]
["2009-06-01",0.7]
["2009-06-02",0.66]
["2009-06-03",1.31]
["2009-06-04",3.25]
["2009-06-05",3.84]
["2009-06-06",5.2]
["2009-06-07",3.4]
["2009-06-08",5.35]
["2009-06-09",3.17]
["2009-06-10",3.75]
["2009-06-11",2.38]
["2009-06-12",1.64]
["2009-06-13",0.71]
["2009-06-14",0.25]
["2009-06-15",1.29]
["2009-06-16",1.85]
["2009-06-17",1.2]
["2009-06-18",0.49]
["2009-06-19",1.6]
["2009-06-20",3.35]
["2009-06-21",2.92]
["2009-06-22",1.76]
["2009-06-23",1.98]
["2009-06-24",0.68]
["2009-06-25",0]
["2009-06-26",0]
["2009-06-27",0.37]
["2009-06-28",0.26]
["2009-06-29",0]
["2009-06-30",0]
["2009-07-01",0]
["2009-07-02",0]
["2009-07-03",0]
["2009-07-04",0.04]
["2009-07-05",0]
["2009-07-06",0.12]
["2009-07-07",0.79]
["2009-07-08",1.0900000000000001]
["2009-07-09",1.51]
["2009-07-10",1.87]
["2009-07-11",0.72]
["2009-07-12",0.16]
["2009-07-13",0.42]
["2009-07-14",0.25]
["2009-07-15",0.43]
["2009-07-16",0.08]
["2009-07-17",0.76]
["2009-07-18",1.23]
["2009-07-19",0.77]
["2009-07-20",0.86]
["2009-07-21",0]
["2009-07-22",0]
["2009-07-23",0.13]
["2009-07-24",0.77]
["2009-07-25",1.0900000000000001]
["2009-07-26",1.1599999999999999]
["2009-07-27",0.71]
["2009-07-28",0.76]
["2009-07-29",0.67]
["2009-07-30",1.02]
["2009-07-31",0.69]
["2009-08-01",0.1]
["2009-08-02",0.72]
["2009-08-03",0.51]
["2009-08-04",0.86]
["2009-08-05",7.0000000000000007E-2]
["2009-08-06",0]
["2009-08-07",0]
["2009-08-08",7.0000000000000007E-2]
["2009-08-09",0]
["2009-08-10",0.05]
["2009-08-11",0]
["2009-08-12",0.37]
["2009-08-13",0]
["2009-08-14",0.25]
["2009-08-15",0.31]
["2009-08-16",0]
["2009-08-17",0.33]
["2009-08-18",0.67]
["2009-08-19",0]
["2009-08-20",0]
["2009-08-21",0.17]
["2009-08-22",0.4]
["2009-08-23",0.37]
["2009-08-24",0.43]
["2009-08-25",0.23]
["2009-08-26",0.89]
["2009-08-27",0.24]
["2009-08-28",0.21]
["2009-08-29",1.86]
["2009-08-30",1.89]
["2009-08-31",0.78]
["2009-09-01",0.13]
["2009-09-02",1.28]
["2009-09-03",1.01]
["2009-09-04",2.61]
["2009-09-05",3.19]
["2009-09-06",2.69]
["2009-09-07",1.6]
["2009-09-08",0.84]
["2009-09-09",0.12]
["2009-09-10",0.61]
["2009-09-11",1.72]
["2009-09-12",1.68]
["2009-09-13",2.71]
["2009-09-14",2.5]
["2009-09-15",2.64]
["2009-09-16",1.93]
["2009-09-17",1.52]
["2009-09-18",0.5]
["2009-09-19",0.44]
["2009-09-20",0.57999999999999996]
["2009-09-21",0.97]
["2009-09-22",1.2]
["2009-09-23",1.81]
["2009-09-24",1.26]
["2009-09-25",2.4300000000000002]
["2009-09-26",2.39]
["2009-09-27",1.92]
["2009-09-28",2.0099999999999998]
["2009-09-29",1.07]
["2009-09-30",1.81]
["2009-10-01",1.27]
["2009-10-02",4.1500000000000004]
["2009-10-03",5.25]
["2009-10-04",2]
["2009-10-05",2.19]
["2009-10-06",0.61]
["2009-10-07",0.35]
["2009-10-08",0.55000000000000004]
["2009-10-09",1.85]
["2009-10-10",1.26]
["2009-10-11",3.65]
["2009-10-12",4.1500000000000004]
["2009-10-13",5.65]
["2009-10-14",6.5]
["2009-10-15",10.55]
["2009-10-16",7.55]
["2009-10-17",6.75]
["2009-10-18",8.65]
["2009-10-19",10.85]
["2009-10-20",8]
["2009-10-21",5.9]
["2009-10-22",4.8499999999999996]
["2009-10-23",5.3]
["2009-10-24",3.65]
["2009-10-25",5.25]
["2009-10-26",4.5999999999999996]
["2009-10-27",6]
["2009-10-28",5.12]
["2009-10-29",4.9000000000000004]
["2009-10-30",9.1999999999999993]
["2009-10-31",6.2]
["2009-11-01",3.05]
["2009-11-02",7.9]
["2009-11-03",7.7]
["2009-11-04",8.25]
["2009-11-05",8]
["2009-11-06",8.75]
["2009-11-07",9.3000000000000007]
["2009-11-08",11]
["2009-11-09",10.7]
["2009-11-10",10.65]
["2009-11-11",10.8]
["2009-11-12",8.8000000000000007]
["2009-11-13",2.89]
["2009-11-14",5]
["2009-11-15",5.5]
["2009-11-16",4.5999999999999996]
["2009-11-17",7.25]
["2009-11-18",6.6]
["2009-11-19",7.8]
["2009-11-20",5.65]
["2009-11-21",3.8]
["2009-11-22",6.05]
["2009-11-23",6.6]
["2009-11-24",4.0999999999999996]
["2009-11-25",7.15]
["2009-11-26",8.35]
["2009-11-27",8.85]
["2009-11-28",8.85]
["2009-11-29",9.0500000000000007]
["2009-11-30",11.8]
["2009-12-01",10.8]
["2009-12-02",10.4]
["2009-12-03",8.8000000000000007]
["2009-12-04",12.35]
["2009-12-05",8.6]
["2009-12-06",6.3]
["2009-12-07",10.25]
["2009-12-08",10.7]
["2009-12-09",7.55]
["2009-12-10",7.25]
["2009-12-11",10.45]
["2009-12-12",13.45]
["2009-12-13",15.5]
["2009-12-14",17.95]
["2009-12-15",19.100000000000001]
["2009-12-16",17.95]
["2009-12-17",18.399999999999999]
["2009-12-18",19.55]
["2009-12-19",20.149999999999999]
["2009-12-20",18.399999999999999]
["2009-12-21",18.100000000000001]
["2009-12-22",16.100000000000001]
["2009-12-23",15.7]
["2009-12-24",14.2]
["2009-12-25",12.7]
["2009-12-26",14.35]
["2009-12-27",13]
["2009-12-28",14.05]
["2009-12-29",9.35]
["2009-12-30",7.65]
["2009-12-31",12.7]
["2010-01-01",17.149999999999999]
["2010-01-02",16.8]
["2010-01-03",16.3]
["2010-01-04",21.55]
["2010-01-05",19.649999999999999]
["2010-01-06",20.65]
["2010-01-07",20.7]
["2010-01-08",21.65]
["2010-01-09",19.95]
["2010-01-10",18.5]
["2010-01-11",17.899999999999999]
["2010-01-12",17.649999999999999]
["2010-01-13",16.649999999999999]
["2010-01-14",13.95]
["2010-01-15",15.35]
["2010-01-16",11.6]
["2010-01-17",10]
["2010-01-18",13.2]
["2010-01-19",16.05]
["2010-01-20",14.7]
["2010-01-21",12.2]
["2010-01-22",11.8]
["2010-01-23",13.85]
["2010-01-24",12.85]
["2010-01-25",12.6]
["2010-01-26",18.3]
["2010-01-27",17.600000000000001]
["2010-01-28",14.25]
["2010-01-29",12.75]
["2010-01-30",16.7]
["2010-01-31",16.3]
["2010-02-01",15.5]
["2010-02-02",13.2]
["2010-02-03",9.4499999999999993]
["2010-02-04",10.9]
["2010-02-05",8.75]
["2010-02-06",10.9]
["2010-02-07",13.15]
["2010-02-08",14.15]
["2010-02-09",19.3]
["2010-02-10",17.899999999999999]
["2010-02-11",20.350000000000001]
["2010-02-12",19.350000000000001]
["2010-02-13",20.5]
["2010-02-14",17.600000000000001]
["2010-02-15",17.149999999999999]
["2010-02-16",17.75]
["2010-02-17",15.75]
["2010-02-18",11.9]
["2010-02-19",11.85]
["2010-02-20",14.55]
["2010-02-21",12.95]
["2010-02-22",7.9]
["2010-02-23",6.35]
["2010-02-24",8.65]
["2010-02-25",7.9]
["2010-02-26",9.4499999999999993]
["2010-02-27",9.0500000000000007]
["2010-02-28",9.15]
["2010-03-01",11.15]
["2010-03-02",9.5]
["2010-03-03",11.35]
["2010-03-04",12.8]
["2010-03-05",15.05]
["2010-03-06",13.45]
["2010-03-07",17.05]
["2010-03-08",15.7]
["2010-03-09",16.45]
["2010-03-10",14.45]
["2010-03-11",15.05]
["2010-03-12",14.35]
["2010-03-13",11.85]
["2010-03-14",11.25]
["2010-03-15",9.4]
["2010-03-16",8.65]
["2010-03-17",6.9]
["2010-03-18",4.62]
["2010-03-19",2.4300000000000002]
["2010-03-20",3.55]
["2010-03-21",7.4]
["2010-03-22",7.15]
["2010-03-23",6.65]
["2010-03-24",3.86]
["2010-03-25",2.6]
["2010-03-26",6.75]
["2010-03-27",7.85]
["2010-03-28",6.8]
["2010-03-29",3.34]
["2010-03-30",8.5500000000000007]
["2010-03-31",9.35]
["2010-04-01",10.15]
["2010-04-02",9.5500000000000007]
["2010-04-03",8.8000000000000007]
["2010-04-04",8.65]
["2010-04-05",9.6999999999999993]
["2010-04-06",6.18]
["2010-04-07",3.9]
["2010-04-08",7]
["2010-04-09",5.95]
["2010-04-10",5.0999999999999996]
["2010-04-11",8.5500000000000007]
["2010-04-12",8.65]
["2010-04-13",5.7]
["2010-04-14",6.9]
["2010-04-15",6.3]
["2010-04-16",6.9]
["2010-04-17",6.01]
["2010-04-18",3.71]
["2010-04-19",3.67]
["2010-04-20",4.2]
["2010-04-21",6.65]
["2010-04-22",7]
["2010-04-23",5.56]
["2010-04-24",2.94]
["2010-04-25",2.25]
["2010-04-26",4.1500000000000004]
["2010-04-27",3.35]
["2010-04-28",1.67]
["2010-04-29",1.07]
["2010-04-30",3.15]
["2010-05-01",3.85]
["2010-05-02",4.5999999999999996]
["2010-05-03",10.25]
["2010-05-04",8.5]
["2010-05-05",9.4]
["2010-05-06",7.1]
["2010-05-07",7.5]
["2010-05-08",5.35]
["2010-05-09",4.16]
["2010-05-10",5.7]
["2010-05-11",11.15]
["2010-05-12",9.4]
["2010-05-13",9.65]
["2010-05-14",8.1]
["2010-05-15",5.5]
["2010-05-16",5.05]
["2010-05-17",3.25]
["2010-05-18",4.0599999999999996]
["2010-05-19",3.53]
["2010-05-20",2.77]
["2010-05-21",1.54]
["2010-05-22",1.21]
["2010-05-23",1.1399999999999999]
["2010-05-24",0.26]
["2010-05-25",0.05]
["2010-05-26",0.14000000000000001]
["2010-05-27",2.29]
["2010-05-28",2.87]
["2010-05-29",3.35]
["2010-05-30",2.25]
["2010-05-31",3.65]
["2010-06-01",3.6]
["2010-06-02",1.89]
["2010-06-03",1.53]
["2010-06-04",0.56000000000000005]
["2010-06-05",0.03]
["2010-06-06",0.01]
["2010-06-07",1.37]
["2010-06-08",0.24]
["2010-06-09",0.93]
["2010-06-10",0.28999999999999998]
["2010-06-11",0.49]
["2010-06-12",0.63]
["2010-06-13",2.63]
["2010-06-14",1.18]
["2010-06-15",0.99]
["2010-06-16",2.39]
["2010-06-17",0.9]
["2010-06-18",1.43]
["2010-06-19",4.05]
["2010-06-20",5.2]
["2010-06-21",3.62]
["2010-06-22",1.62]
["2010-06-23",0.71]
["2010-06-24",0.32]
["2010-06-25",0.3]
["2010-06-26",0.05]
["2010-06-27",0]
["2010-06-28",0]
["2010-06-29",0.05]
["2010-06-30",0.05]
["2010-07-01",0]
["2010-07-02",0]
["2010-07-03",0]
["2010-07-04",0.33]
["2010-07-05",0.1]
["2010-07-06",0.91]
["2010-07-07",0.24]
["2010-07-08",0]
["2010-07-09",0]
["2010-07-10",0]
["2010-07-11",0]
["2010-07-12",0]
["2010-07-13",0]
["2010-07-14",0.18]
["2010-07-15",0.68]
["2010-07-16",0.32]
["2010-07-17",0.66]
["2010-07-18",0.91]
["2010-07-19",0.28000000000000003]
["2010-07-20",0]
["2010-07-21",0]
["2010-07-22",0.51]
["2010-07-23",0.53]
["2010-07-24",0.75]
["2010-07-25",0.06]
["2010-07-26",0.16]
["2010-07-27",0]
["2010-07-28",0]
["2010-07-29",0.56000000000000005]
["2010-07-30",0.78]
["2010-07-31",0]
["2010-08-01",0.03]
["2010-08-02",0.14000000000000001]
["2010-08-03",0.79]
["2010-08-04",0.06]
["2010-08-05",1.06]
["2010-08-06",1.47]
["2010-08-07",0.64]
["2010-08-08",0.56999999999999995]
["2010-08-09",0.08]
["2010-08-10",0.24]
["2010-08-11",7.0000000000000007E-2]
["2010-08-12",0.87]
["2010-08-13",0.81]
["2010-08-14",1.1000000000000001]
["2010-08-15",2.15]
["2010-08-16",1.85]
["2010-08-17",0.81]
["2010-08-18",0.51]
["2010-08-19",2.08]
["2010-08-20",0.28000000000000003]
["2010-08-21",0]
["2010-08-22",0]
["2010-08-23",0]
["2010-08-24",1.18]
["2010-08-25",0.57999999999999996]
["2010-08-26",0]
["2010-08-27",0.05]
["2010-08-28",1.36]
["2010-08-29",2.11]
["2010-08-30",2.89]
["2010-08-31",2.4300000000000002]
["2010-09-01",1.8]
["2010-09-02",1.34]
["2010-09-03",1.42]
["2010-09-04",1.2]
["2010-09-05",1.0900000000000001]
["2010-09-06",1.08]
["2010-09-07",0.98]
["2010-09-08",1.8]
["2010-09-09",1.61]
["2010-09-10",1.55]
["2010-09-11",1.36]
["2010-09-12",0.44]
["2010-09-13",2.08]
["2010-09-14",0.77]
["2010-09-15",1.62]
["2010-09-16",2.63]
["2010-09-17",3.25]
["2010-09-18",4.5199999999999996]
["2010-09-19",4.08]
["2010-09-20",3.28]
["2010-09-21",1.98]
["2010-09-22",1.67]
["2010-09-23",1.1599999999999999]
["2010-09-24",1.94]
["2010-09-25",5.05]
["2010-09-26",7.3]
["2010-09-27",6.65]
["2010-09-28",5.15]
["2010-09-29",2.0699999999999998]
["2010-09-30",2.75]
["2010-10-01",4.55]
["2010-10-02",1.35]
["2010-10-03",0.67]
["2010-10-04",0.81]
["2010-10-05",2.95]
["2010-10-06",1.24]
["2010-10-07",0.74]
["2010-10-08",1.1499999999999999]
["2010-10-09",0.96]
["2010-10-10",2.16]
["2010-10-11",3.18]
["2010-10-12",5.45]
["2010-10-13",8]
["2010-10-14",7.15]
["2010-10-15",6.2]
["2010-10-16",6.35]
["2010-10-17",11.8]
["2010-10-18",9.25]
["2010-10-19",6.1]
["2010-10-20",8.6999999999999993]
["2010-10-21",11.15]
["2010-10-22",10.95]
["2010-10-23",10.9]
["2010-10-24",8.9]
["2010-10-25",9.1999999999999993]
["2010-10-26",9.9]
["2010-10-27",6.45]
["2010-10-28",5.95]
["2010-10-29",6]
["2010-10-30",4.8499999999999996]
["2010-10-31",4.7]
["2010-11-01",6.2]
["2010-11-02",8.1]
["2010-11-03",3.8]
["2010-11-04",1.95]
["2010-11-05",3.11]
["2010-11-06",6.15]
["2010-11-07",10.15]
["2010-11-08",12.15]
["2010-11-09",10.15]
["2010-11-10",9.5500000000000007]
["2010-11-11",9.5]
["2010-11-12",4.95]
["2010-11-13",3.4]
["2010-11-14",5.25]
["2010-11-15",8.9]
["2010-11-16",8.9]
["2010-11-17",13.6]
["2010-11-18",11.1]
["2010-11-19",11.45]
["2010-11-20",9.35]
["2010-11-21",12.2]
["2010-11-22",13.05]
["2010-11-23",12.95]
["2010-11-24",11.85]
["2010-11-25",14.3]
["2010-11-26",15.95]
["2010-11-27",16.399999999999999]
["2010-11-28",17.5]
["2010-11-29",18.149999999999999]
["2010-11-30",19.899999999999999]
["2010-12-01",19.75]
["2010-12-02",19.649999999999999]
["2010-12-03",18.55]
["2010-12-04",18.05]
["2010-12-05",15.05]
["2010-12-06",16]
["2010-12-07",16.95]
["2010-12-08",16.649999999999999]
["2010-12-09",15.45]
["2010-12-10",15.4]
["2010-12-11",11.95]
["2010-12-12",11.45]
["2010-12-13",17.649999999999999]
["2010-12-14",17.850000000000001]
["2010-12-15",17.649999999999999]
["2010-12-16",14.7]
["2010-12-17",16.8]
["2010-12-18",18.25]
["2010-12-19",15.65]
["2010-12-20",15.75]
["2010-12-21",14.7]
["2010-12-22",15.65]
["2010-12-23",17.8]
["2010-12-24",17.7]
["2010-12-25",18.5]
["2010-12-26",18]
["2010-12-27",18.95]
["2010-12-28",17]
["2010-12-29",13.25]
["2010-12-30",14.5]
["2010-12-31",16.75]
["2011-01-01",16.399999999999999]
["2011-01-02",14.7]
["2011-01-03",14.95]
["2011-01-04",17.899999999999999]
["2011-01-05",13.7]
["2011-01-06",9.9499999999999993]
["2011-01-07",6.55]
["2011-01-08",6.2]
["2011-01-09",11.25]
["2011-01-10",12.85]
["2011-01-11",12.25]
["2011-01-12",8.9499999999999993]
["2011-01-13",4.5999999999999996]
["2011-01-14",6.85]
["2011-01-15",8.85]
["2011-01-16",7.75]
["2011-01-17",11.1]
["2011-01-18",9.6999999999999993]
["2011-01-19",13.5]
["2011-01-20",13.7]
["2011-01-21",16.600000000000001]
["2011-01-22",15.15]
["2011-01-23",12.8]
["2011-01-24",12.15]
["2011-01-25",12.9]
["2011-01-26",13.05]
["2011-01-27",14.5]
["2011-01-28",17.05]
["2011-01-29",17.600000000000001]
["2011-01-30",18.5]
["2011-01-31",19.95]
["2011-02-01",19.7]
["2011-02-02",16]
["2011-02-03",12.25]
["2011-02-04",10.3]
["2011-02-05",7.5]
["2011-02-06",8.85]
["2011-02-07",9.25]
["2011-02-08",8.5]
["2011-02-09",10.8]
["2011-02-10",9.6999999999999993]
["2011-02-11",3.75]
["2011-02-12",8.6]
["2011-02-13",11.7]
["2011-02-14",9.65]
["2011-02-15",11.3]
["2011-02-16",11]
["2011-02-17",12.2]
["2011-02-18",13.7]
["2011-02-19",13.6]
["2011-02-20",11.35]
["2011-02-21",11.25]
["2011-02-22",12.85]
["2011-02-23",12.5]
["2011-02-24",8.9499999999999993]
["2011-02-25",7.85]
["2011-02-26",7.9]
["2011-02-27",10.55]
["2011-02-28",13.25]
["2011-03-01",12.1]
["2011-03-02",11.85]
["2011-03-03",12.95]
["2011-03-04",12.2]
["2011-03-05",12.55]
["2011-03-06",12.85]
["2011-03-07",12.7]
["2011-03-08",9.8000000000000007]
["2011-03-09",8.5500000000000007]
["2011-03-10",9.75]
["2011-03-11",7.25]
["2011-03-12",7.85]
["2011-03-13",7.3]
["2011-03-14",5.8]
["2011-03-15",3.65]
["2011-03-16",4.4000000000000004]
["2011-03-17",10.050000000000001]
["2011-03-18",8.4499999999999993]
["2011-03-19",10.3]
["2011-03-20",9.5]
["2011-03-21",8.15]
["2011-03-22",6.05]
["2011-03-23",4.71]
["2011-03-24",3.97]
["2011-03-25",3.96]
["2011-03-26",2.65]
["2011-03-27",4.8]
["2011-03-28",4.75]
["2011-03-29",5.7]
["2011-03-30",5.65]
["2011-03-31",4.8]
["2011-04-01",3.85]
["2011-04-02",2.68]
["2011-04-03",6.85]
["2011-04-04",6.15]
["2011-04-05",5.16]
["2011-04-06",2.82]
["2011-04-07",1.23]
["2011-04-08",2.16]
["2011-04-09",2.66]
["2011-04-10",1.86]
["2011-04-11",1.61]
["2011-04-12",6.45]
["2011-04-13",8.1]
["2011-04-14",5.75]
["2011-04-15",4.3499999999999996]
["2011-04-16",4.8099999999999996]
["2011-04-17",4.5999999999999996]
["2011-04-18",2.73]
["2011-04-19",1.73]
["2011-04-20",1.0900000000000001]
["2011-04-21",1.79]
["2011-04-22",0.99]
["2011-04-23",0.49]
["2011-04-24",1.04]
["2011-04-25",0.77]
["2011-04-26",1.8]
["2011-04-27",2.78]
["2011-04-28",7.55]
["2011-04-29",3.6]
["2011-04-30",2.5]
["2011-05-01",1.73]
["2011-05-02",1.83]
["2011-05-03",5.43]
["2011-05-04",4.5199999999999996]
["2011-05-05",3.39]
["2011-05-06",2.16]
["2011-05-07",0.51]
["2011-05-08",0.18]
["2011-05-09",0.63]
["2011-05-10",0.36]
["2011-05-11",1.23]
["2011-05-12",2.74]
["2011-05-13",3.01]
["2011-05-14",3.17]
["2011-05-15",4.1500000000000004]
["2011-05-16",3.84]
["2011-05-17",2.2799999999999998]
["2011-05-18",1.42]
["2011-05-19",1.31]
["2011-05-20",1.07]
["2011-05-21",2.0699999999999998]
["2011-05-22",0.5]
["2011-05-23",1.83]
["2011-05-24",2.09]
["2011-05-25",2.4500000000000002]
["2011-05-26",1.98]
["2011-05-27",3.55]
["2011-05-28",3.28]
["2011-05-29",1.61]
["2011-05-30",0.86]
["2011-05-31",3.02]
["2011-06-01",2.93]
["2011-06-02",1.57]
["2011-06-03",0.45]
["2011-06-04",0]
["2011-06-05",0]
["2011-06-06",1.6]
["2011-06-07",2.4]
["2011-06-08",2.02]
["2011-06-09",2.34]
["2011-06-10",2.46]
["2011-06-11",4.45]
["2011-06-12",2.9]
["2011-06-13",1.37]
["2011-06-14",0.31]
["2011-06-15",0.12]
["2011-06-16",0.15]
["2011-06-17",2.13]
["2011-06-18",2.9]
["2011-06-19",2.94]
["2011-06-20",1.51]
["2011-06-21",0.66]
["2011-06-22",1.55]
["2011-06-23",1.86]
["2011-06-24",2.73]
["2011-06-25",0.41]
["2011-06-26",0.11]
["2011-06-27",0]
["2011-06-28",0]
["2011-06-29",0.47]
["2011-06-30",1.78]
["2011-07-01",1.74]
["2011-07-02",1.61]
["2011-07-03",1.77]
["2011-07-04",0.76]
["2011-07-05",0.25]
["2011-07-06",0.45]
["2011-07-07",1.56]
["2011-07-08",0.91]
["2011-07-09",0.64]
["2011-07-10",0.43]
["2011-07-11",0.63]
["2011-07-12",0.17]
["2011-07-13",1.29]
["2011-07-14",2]
["2011-07-15",0.95]
["2011-07-16",0.53]
["2011-07-17",2.04]
["2011-07-18",1.53]
["2011-07-19",3.55]
["2011-07-20",2.46]
["2011-07-21",1.1599999999999999]
["2011-07-22",0.6]
["2011-07-23",1.97]
["2011-07-24",1.88]
["2011-07-25",0.62]
["2011-07-26",0.43]
["2011-07-27",1.45]
["2011-07-28",0.57999999999999996]
["2011-07-29",0.81]
["2011-07-30",1.24]
["2011-07-31",1.29]
["2011-08-01",0.82]
["2011-08-02",0.33]
["2011-08-03",0.01]
["2011-08-04",0.02]
["2011-08-05",0.11]
["2011-08-06",7.0000000000000007E-2]
["2011-08-07",1.66]
["2011-08-08",1.62]
["2011-08-09",1.55]
["2011-08-10",2.0099999999999998]
["2011-08-11",1.1200000000000001]
["2011-08-12",0.14000000000000001]
["2011-08-13",0.27]
["2011-08-14",0.25]
["2011-08-15",0.92]
["2011-08-16",0.17]
["2011-08-17",0.24]
["2011-08-18",0.03]
["2011-08-19",0]
["2011-08-20",0.27]
["2011-08-21",0]
["2011-08-22",0]
["2011-08-23",0]
["2011-08-24",0.3]
["2011-08-25",0.05]
["2011-08-26",1.45]
["2011-08-27",2.13]
["2011-08-28",1.85]
["2011-08-29",2.4300000000000002]
["2011-08-30",2.4]
["2011-08-31",2.11]
["2011-09-01",0.5]
["2011-09-02",0.09]
["2011-09-03",0.08]
["2011-09-04",0.01]
["2011-09-05",1.34]
["2011-09-06",1.73]
["2011-09-07",1.64]
["2011-09-08",1.6]
["2011-09-09",0]
["2011-09-10",7.0000000000000007E-2]
["2011-09-11",0.85]
["2011-09-12",0.76]
["2011-09-13",0.39]
["2011-09-14",2.99]
["2011-09-15",2.4500000000000002]
["2011-09-16",1.47]
["2011-09-17",1.9]
["2011-09-18",4.5999999999999996]
["2011-09-19",2.41]
["2011-09-20",1.71]
["2011-09-21",0.84]
["2011-09-22",1.9]
["2011-09-23",2.69]
["2011-09-24",2.11]
["2011-09-25",0.99]
["2011-09-26",0.55000000000000004]
["2011-09-27",0.2]
["2011-09-28",0.4]
["2011-09-29",0.55000000000000004]
["2011-09-30",0.57999999999999996]
["2011-10-01",0.51]
["2011-10-02",0.42]
["2011-10-03",0.95]
["2011-10-04",0.56999999999999995]
["2011-10-05",0.91]
["2011-10-06",1.56]
["2011-10-07",5.4]
["2011-10-08",5.4]
["2011-10-09",3.45]
["2011-10-10",1.34]
["2011-10-11",1.3]
["2011-10-12",2.25]
["2011-10-13",1.1299999999999999]
["2011-10-14",4.5]
["2011-10-15",6.9]
["2011-10-16",6.25]
["2011-10-17",4.25]
["2011-10-18",5.0999999999999996]
["2011-10-19",7.45]
["2011-10-20",8.9]
["2011-10-21",10.15]
["2011-10-22",11.3]
["2011-10-23",6.18]
["2011-10-24",5.4]
["2011-10-25",4]
["2011-10-26",6.15]
["2011-10-27",5]
["2011-10-28",3.2]
["2011-10-29",2.4500000000000002]
["2011-10-30",4.5]
["2011-10-31",4.3499999999999996]
["2011-11-01",6.4]
["2011-11-02",4.9000000000000004]
["2011-11-03",2]
["2011-11-04",3.35]
["2011-11-05",2.65]
["2011-11-06",3.75]
["2011-11-07",7.2]
["2011-11-08",7.9]
["2011-11-09",4.3499999999999996]
["2011-11-10",6.75]
["2011-11-11",9.35]
["2011-11-12",5.85]
["2011-11-13",6.5]
["2011-11-14",8.3000000000000007]
["2011-11-15",12.5]
["2011-11-16",13.1]
["2011-11-17",9.0500000000000007]
["2011-11-18",7.55]
["2011-11-19",8.65]
["2011-11-20",8.4]
["2011-11-21",8.1999999999999993]
["2011-11-22",6.75]
["2011-11-23",6.35]
["2011-11-24",8.5500000000000007]
["2011-11-25",10.55]
["2011-11-26",10.9]
["2011-11-27",7.95]
["2011-11-28",10.65]
["2011-11-29",9.65]
["2011-11-30",8.5500000000000007]
["2011-12-01",8.35]
["2011-12-02",8.85]
["2011-12-03",8.6]
["2011-12-04",5.65]
["2011-12-05",10.7]
["2011-12-06",10.199999999999999]
["2011-12-07",8.5]
["2011-12-08",9.35]
["2011-12-09",9.65]
["2011-12-10",11.5]
["2011-12-11",12.45]
["2011-12-12",9.75]
["2011-12-13",8.5]
["2011-12-14",9.9499999999999993]
["2011-12-15",8.6999999999999993]
["2011-12-16",9.8000000000000007]
["2011-12-17",12.35]
["2011-12-18",13.75]
["2011-12-19",13.8]
["2011-12-20",11.4]
["2011-12-21",8.9]
["2011-12-22",6.8]
["2011-12-23",8.9499999999999993]
["2011-12-24",10.8]
["2011-12-25",10.1]
["2011-12-26",8.25]
["2011-12-27",15.05]
["2011-12-28",13.45]
["2011-12-29",11.15]
["2011-12-30",9.0500000000000007]
["2011-12-31",8.35]
["2012-01-01",4.7]
["2012-01-02",9.8000000000000007]
["2012-01-03",9.75]
["2012-01-04",9.65]
["2012-01-05",7.1]
["2012-01-06",10.65]
["2012-01-07",9.4499999999999993]
["2012-01-08",9.5]
["2012-01-09",7.9]
["2012-01-10",7.95]
["2012-01-11",7.7]
["2012-01-12",10.15]
["2012-01-13",10.15]
["2012-01-14",13.75]
["2012-01-15",14.65]
["2012-01-16",15.35]
["2012-01-17",16.3]
["2012-01-18",13.15]
["2012-01-19",8.4499999999999993]
["2012-01-20",9.4499999999999993]
["2012-01-21",6.9]
["2012-01-22",8.25]
["2012-01-23",10.050000000000001]
["2012-01-24",10.35]
["2012-01-25",9.4499999999999993]
["2012-01-26",9.8000000000000007]
["2012-01-27",11.45]
["2012-01-28",13.3]
["2012-01-29",15.65]
["2012-01-30",17.399999999999999]
["2012-01-31",17.850000000000001]
["2012-02-01",20.5]
["2012-02-02",22.15]
["2012-02-03",22.7]
["2012-02-04",21.85]
["2012-02-05",22.55]
["2012-02-06",20.350000000000001]
["2012-02-07",22.15]
["2012-02-08",22.35]
["2012-02-09",20]
["2012-02-10",19.850000000000001]
["2012-02-11",21.15]
["2012-02-12",20.95]
["2012-02-13",15.8]
["2012-02-14",12.7]
["2012-02-15",11]
["2012-02-16",10.6]
["2012-02-17",10.85]
["2012-02-18",8.65]
["2012-02-19",12.35]
["2012-02-20",14.1]
["2012-02-21",13.4]
["2012-02-22",13.5]
["2012-02-23",8.65]
["2012-02-24",6.5]
["2012-02-25",7.9]
["2012-02-26",8.85]
["2012-02-27",9.6]
["2012-02-28",7.85]
["2012-02-29",7]
["2012-03-01",8.15]
["2012-03-02",8]
["2012-03-03",9.4]
["2012-03-04",8.5500000000000007]
["2012-03-05",11.6]
["2012-03-06",12.2]
["2012-03-07",13.05]
["2012-03-08",10.5]
["2012-03-09",9.4499999999999993]
["2012-03-10",7.3]
["2012-03-11",6.95]
["2012-03-12",6]
["2012-03-13",6.15]
["2012-03-14",7.5]
["2012-03-15",4.88]
["2012-03-16",3.42]
["2012-03-17",7.05]
["2012-03-18",8.9]
["2012-03-19",9.5500000000000007]
["2012-03-20",8.9]
["2012-03-21",6.35]
["2012-03-22",3.32]
["2012-03-23",3.11]
["2012-03-24",2.83]
["2012-03-25",2.7]
["2012-03-26",3.04]
["2012-03-27",3.37]
["2012-03-28",2.81]
["2012-03-29",3.13]
["2012-03-30",3.93]
["2012-03-31",8.35]
["2012-04-01",9.4]
["2012-04-02",6.85]
["2012-04-03",4.9000000000000004]
["2012-04-04",7.8]
["2012-04-05",8.5]
["2012-04-06",7.55]
["2012-04-07",8]
["2012-04-08",10.65]
["2012-04-09",7]
["2012-04-10",7.85]
["2012-04-11",9.75]
["2012-04-12",7.9]
["2012-04-13",7.8]
["2012-04-14",6.3]
["2012-04-15",10.050000000000001]
["2012-04-16",10.65]
["2012-04-17",11.85]
["2012-04-18",9.85]
["2012-04-19",8.25]
["2012-04-20",7.55]
["2012-04-21",8.25]
["2012-04-22",9.1]
["2012-04-23",9.4]
["2012-04-24",8.15]
["2012-04-25",7.75]
["2012-04-26",4.6500000000000004]
["2012-04-27",5.95]
["2012-04-28",3.04]
["2012-04-29",2.64]
["2012-04-30",3.82]
["2012-05-01",3.31]
["2012-05-02",5.4]
["2012-05-03",3.22]
["2012-05-04",2.59]
["2012-05-05",4.2]
["2012-05-06",6.35]
["2012-05-07",5.03]
["2012-05-08",2.76]
["2012-05-09",0.9]
["2012-05-10",0.44]
["2012-05-11",1.33]
["2012-05-12",4.5]
["2012-05-13",6.55]
["2012-05-14",4.25]
["2012-05-15",8.1999999999999993]
["2012-05-16",6.55]
["2012-05-17",6.25]
["2012-05-18",3.51]
["2012-05-19",3.66]
["2012-05-20",1.98]
["2012-05-21",5.4]
["2012-05-22",2.2000000000000002]
["2012-05-23",1.26]
["2012-05-24",0.47]
["2012-05-25",0]
["2012-05-26",0.38]
["2012-05-27",0.28000000000000003]
["2012-05-28",0.71]
["2012-05-29",0.77]
["2012-05-30",0.42]
["2012-05-31",0.89]
["2012-06-01",0.73]
["2012-06-02",0.55000000000000004]
["2012-06-03",0.92]
["2012-06-04",3.55]
["2012-06-05",4.1100000000000003]
["2012-06-06",1.57]
["2012-06-07",0.85]
["2012-06-08",1.66]
["2012-06-09",3.45]
["2012-06-10",2.74]
["2012-06-11",1.83]
["2012-06-12",4.2]
["2012-06-13",3.1]
["2012-06-14",2.64]
["2012-06-15",0.92]
["2012-06-16",1.01]
["2012-06-17",1.99]
["2012-06-18",1.74]
["2012-06-19",1.4]
["2012-06-20",1.21]
["2012-06-21",0.14000000000000001]
["2012-06-22",1.71]
["2012-06-23",1.75]
["2012-06-24",2.6]
["2012-06-25",2.0099999999999998]
["2012-06-26",0.6]
["2012-06-27",0.24]
["2012-06-28",0]
["2012-06-29",0.28000000000000003]
["2012-06-30",0.94]
["2012-07-01",0.96560000000000001]
["2012-07-02",0.98783177570093428]
["2012-07-03",0.73552577319587653]
["2012-07-04",0]
["2012-07-05",7.1261538461538682E-2]
["2012-07-06",0.83718918918918894]
["2012-07-07",1.5516799999999995]
["2012-07-08",0.98494915254237259]
["2012-07-09",0.66471910112359556]
["2012-07-10",0.71470588235294108]
["2012-07-11",2.0184838709677422]
["2012-07-12",2.1011864406779663]
["2012-07-13",1.8521052631578949]
["2012-07-14",1.6920449438202243]
["2012-07-15",2.1848656716417918]
["2012-07-16",2.3060526315789476]
["2012-07-17",0.25985714285714268]
["2012-07-18",0.12158415841584158]
["2012-07-19",0.68571428571428594]
["2012-07-20",0.67727272727272725]
["2012-07-21",1.65672]
["2012-07-22",1.1544778761061947]
["2012-07-23",0.54483870967741943]
["2012-07-24",0.17165217391304327]
["2012-07-25",0]
["2012-07-26",0]
["2012-07-27",0]
["2012-07-28",0]
["2012-07-29",1.6504347826086954]
["2012-07-30",2.1981818181818182]
["2012-07-31",1.0349999999999999]
["2012-08-01",0.37384105960264896]
["2012-08-02",0.16472727272727258]
["2012-08-03",0.78283636363636355]
["2012-08-04",0.59594827586206889]
["2012-08-05",0.54260869565217407]
["2012-08-06",1.0558556701030926]
["2012-08-07",1.2366206896551728]
["2012-08-08",1.0027999999999997]
["2012-08-09",0.20915094339622642]
["2012-08-10",0.3772000000000002]
["2012-08-11",0.48982481751824825]
["2012-08-12",0.31135135135135128]
["2012-08-13",0.11348780487804855]
["2012-08-14",0.19350495049504926]
["2012-08-15",0]
["2012-08-16",0.78873134328358219]
["2012-08-17",9.3262499999999818E-2]
["2012-08-18",0]
["2012-08-19",0]
["2012-08-20",0]
["2012-08-21",0]
["2012-08-22",0.40186666666666648]
["2012-08-23",0.64]
["2012-08-24",0.14000000000000001]
["2012-08-25",0.37153846153846143]
["2012-08-26",0.54202352941176468]
["2012-08-27",0.33733333333333321]
["2012-08-28",0]
["2012-08-29",7.6579999999999898E-2]
["2012-08-30",0.65249999999999997]
["2012-08-31",2.6411538461538466]
["2012-09-01",2.8253658536585364]
["2012-09-02",1.0695445544554454]
["2012-09-03",0.58655999999999997]
["2012-09-04",0.53464150943396238]
["2012-09-05",0.27329729729729757]
["2012-09-06",2.0111764705882353]
["2012-09-07",1.6588799999999999]
["2012-09-08",0.94870370370370349]
["2012-09-09",0.60263583815028898]
["2012-09-10",8.4883720930233834E-3]
["2012-09-11",1.29]
["2012-09-12",2.85]
["2012-09-13",2.2549999999999999]
["2012-09-14",4.5999999999999996]
["2012-09-15",1.3446153846153843]
["2012-09-16",2.2254545454545451]
["2012-09-17",1.3049999999999999]
["2012-09-18",1.5896399999999997]
["2012-09-19",3.95]
["2012-09-20",5.1675700934579449]
["2012-09-21",5.15]
["2012-09-22",3.6945454545454544]
["2012-09-23",1.8833749999999998]
["2012-09-24",1.0665]
["2012-09-25",3.45]
["2012-09-26",2.9]
["2012-09-27",3.85]
["2012-09-28",4.1067142857142862]
["2012-09-29",4.2]
["2012-09-30",5.2]
["2012-10-01",4.7520000000000007]
["2012-10-02",1.6889062500000001]
["2012-10-03",2.2000000000000002]
["2012-10-04",2.75]
["2012-10-05",1.5954130434782605]
["2012-10-06",2.5307499999999998]
["2012-10-07",4.25]
["2012-10-08",4.2]
["2012-10-09",2.85]
["2012-10-10",4.8499999999999996]
["2012-10-11",2.2588936170212759]
["2012-10-12",3.5]
["2012-10-13",7.45]
["2012-10-14",10.1]
["2012-10-15",8]
["2012-10-16",6]
["2012-10-17",5.45]
["2012-10-18",1.8842432432432432]
["2012-10-19",1.8329999999999997]
["2012-10-20",3.45]
["2012-10-21",1.1875862068965513]
["2012-10-22",0.93829411764705895]
["2012-10-23",1.3746808510638298]
["2012-10-24",7.2]
["2012-10-25",5.45]
["2012-10-26",8.1]
["2012-10-27",12.15]
["2012-10-28",11.85]
["2012-10-29",9.4499999999999993]
["2012-10-30",9.1999999999999993]
["2012-10-31",10.7]
["2012-11-01",8.3000000000000007]
["2012-11-02",10.3]
["2012-11-03",8.1]
["2012-11-04",8.6999999999999993]
["2012-11-05",8.8000000000000007]
["2012-11-06",10.4]
["2012-11-07",8.35]
["2012-11-08",9.1]
["2012-11-09",10.75]
["2012-11-10",6.75]
["2012-11-11",9.75]
["2012-11-12",12.45]
["2012-11-13",10.55]
["2012-11-14",13.8]
["2012-11-15",12.55]
["2012-11-16",13.15]
["2012-11-17",10.7]
["2012-11-18",8.8000000000000007]
["2012-11-19",7.6]
["2012-11-20",8.0500000000000007]
["2012-11-21",8.5500000000000007]
["2012-11-22",11]
["2012-11-23",9.5500000000000007]
["2012-11-24",7]
["2012-11-25",7.35]
["2012-11-26",8.8000000000000007]
["2012-11-27",10.4]
["2012-11-28",10.65]
["2012-11-29",11.75]
["2012-11-30",14.2]
["2012-12-01",14.65]
["2012-12-02",14.4]
["2012-12-03",11.55]
["2012-12-04",11.9]
["2012-12-05",14.3]
["2012-12-06",15.25]
["2012-12-07",14.65]
["2012-12-08",15.6]
["2012-12-09",14.75]
["2012-12-10",12.35]
["2012-12-11",15.2]
["2012-12-12",18.5]
["2012-12-13",16.350000000000001]
["2012-12-14",10.25]
["2012-12-15",8.5]
["2012-12-16",8.6999999999999993]
["2012-12-17",9.4]
["2012-12-18",10.8]
["2012-12-19",11.45]
["2012-12-20",10.4]
["2012-12-21",9.9499999999999993]
["2012-12-22",7.8000000000000007]
["2012-12-23",4.1999999999999993]
["2012-12-24",7.25]
["2012-12-25",7.1999999999999993]
["2012-12-26",8.6]
["2012-12-27",7.9499999999999993]
["2012-12-28",8.3000000000000007]
["2012-12-29",7.3000000000000007]
["2012-12-30",9.6]
["2012-12-31",8.75]
["2013-01-01",10.15]
["2013-01-02",11.5]
["2013-01-03",8.85]
["2013-01-04",8.15]
["2013-01-05",8.9499999999999993]
["2013-01-06",10.050000000000001]
["2013-01-07",10.65]
["2013-01-08",13.3]
["2013-01-09",13.2]
["2013-01-10",10.9]
["2013-01-11",12.45]
["2013-01-12",13.95]
["2013-01-13",14.55]
["2013-01-14",17.95]
["2013-01-15",16.2]
["2013-01-16",18.7]
["2013-01-17",20]
["2013-01-18",21.1]
["2013-01-19",19.149999999999999]
["2013-01-20",19.2]
["2013-01-21",17.600000000000001]
["2013-01-22",16.45]
["2013-01-23",14.65]
["2013-01-24",17.350000000000001]
["2013-01-25",20.55]
["2013-01-26",16.600000000000001]
["2013-01-27",12.7]
["2013-01-28",11.2]
["2013-01-29",7.1000000000000014]
["2013-01-30",5.8000000000000007]
["2013-01-31",10.199999999999999]
["2013-02-01",9]
["2013-02-02",13.4]
["2013-02-03",12.45]
["2013-02-04",9.8000000000000007]
["2013-02-05",13.1]
["2013-02-06",13.15]
["2013-02-07",13.75]
["2013-02-08",14.4]
["2013-02-09",15.3]
["2013-02-10",15.55]
["2013-02-11",13.45]
["2013-02-12",15.5]
["2013-02-13",16.899999999999999]
["2013-02-14",15.3]
["2013-02-15",10.5]
["2013-02-16",11.649999999999999]
["2013-02-17",14.35]
["2013-02-18",13.7]
["2013-02-19",13]
["2013-02-20",12.7]
["2013-02-21",16.95]
["2013-02-22",18.3]
["2013-02-23",20.2]
["2013-02-24",18.100000000000001]
["2013-02-25",16.850000000000001]
["2013-02-26",14.75]
["2013-02-27",14.55]
["2013-02-28",15.55]
["2013-03-01",14.8]
["2013-03-02",15.25]
["2013-03-03",13.95]
["2013-03-04",10.8]
["2013-03-05",7.1000000000000014]
["2013-03-06",5.25]
["2013-03-07",6]
["2013-03-08",6.5]
["2013-03-09",5.8000000000000007]
["2013-03-10",11.149999999999999]
["2013-03-11",16.350000000000001]
["2013-03-12",20]
["2013-03-13",18.95]
["2013-03-14",15.2]
["2013-03-15",15.05]
["2013-03-16",12.149999999999999]
["2013-03-17",10.9]
["2013-03-18",13.5]
["2013-03-19",10.8]
["2013-03-20",11.15]
["2013-03-21",11.4]
["2013-03-22",8.0500000000000007]
["2013-03-23",7.8000000000000007]
["2013-03-24",12.1]
["2013-03-25",12.05]
["2013-03-26",13.7]
["2013-03-27",13.850000000000001]
["2013-03-28",12.7]
["2013-03-29",14.6]
["2013-03-30",14.65]
["2013-03-31",15.05]
["2013-04-01",12.9]
["2013-04-02",11.95]
["2013-04-03",12.2]
["2013-04-04",13.2]
["2013-04-05",11.5]
["2013-04-06",12.35]
["2013-04-07",10.899999999999999]
["2013-04-08",9.6999999999999993]
["2013-04-09",9.1]
["2013-04-10",6.8500000000000014]
["2013-04-11",5.9]
["2013-04-12",5.2000000000000011]
["2013-04-13",7.1999999999999993]
["2013-04-14",1.4667999999999997]
["2013-04-15",1.0595454545454543]
["2013-04-16",2.2813043478260875]
["2013-04-17",1.1407999999999998]
["2013-04-18",2.6500000000000004]
["2013-04-19",8.25]
["2013-04-20",8.1999999999999993]
["2013-04-21",7.1000000000000014]
["2013-04-22",7.5]
["2013-04-23",4.7884363636363636]
["2013-04-24",2.5484275862068966]
["2013-04-25",1.3347183098591551]
["2013-04-26",5.3999999999999986]
["2013-04-27",8.6]
["2013-04-28",9.0500000000000007]
["2013-04-29",8.65]
["2013-04-30",7.3000000000000007]
["2013-05-01",6.65]
["2013-05-02",3.6602247191011243]
["2013-05-03",4.6499999999999986]
["2013-05-04",5.1999999999999993]
["2013-05-05",2.4699999999999998]
["2013-05-06",3.5977884615384617]
["2013-05-07",2.425210526315789]
["2013-05-08",1.9205773195876292]
["2013-05-09",3.5]
["2013-05-10",6]
["2013-05-11",4.0085121951219502]
["2013-05-12",5.5500000000000007]
["2013-05-13",3.7000000000000011]
["2013-05-14",5.0500000000000007]
["2013-05-15",4.8000000000000007]
["2013-05-16",5.75]
["2013-05-17",4.9000000000000004]
["2013-05-18",5.9499999999999993]
["2013-05-19",4.75]
["2013-05-20",6.75]
["2013-05-21",6.65]
["2013-05-22",5.0500000000000007]
["2013-05-23",8.1999999999999993]
["2013-05-24",11.35]
["2013-05-25",7.35]
["2013-05-26",6.3000000000000007]
["2013-05-27",4.8994883720930229]
["2013-05-28",4.6500000000000004]
["2013-05-29",6.4]
["2013-05-30",5.4]
["2013-05-31",4]
["2013-06-01",2.3421276600000001]
["2013-06-02",3.6287157890000001]
["2013-06-03",4.5887878789999998]
["2013-06-04",4.1048275859999999]
["2013-06-05",2.047135135]
["2013-06-06",0.87590411000000001]
["2013-06-07",0.162661157]
["2013-06-08",0.45275862099999997]
["2013-06-09",4.4000000000000004]
["2013-06-10",2.4449438200000002]
["2013-06-11",1.3396153850000001]
["2013-06-12",0.32349090899999999]
["2013-06-13",2.2694285710000002]
["2013-06-14",2.6496]
["2013-06-15",2.0384776119999999]
["2013-06-16",1.6220983609999999]
["2013-06-17",0.446588235]
["2013-06-18",3.7793103000000002E-2]
["2013-06-19",4.9375000000000002E-2]
["2013-06-20",7.0909090999999994E-2]
["2013-06-21",0.95610526299999998]
["2013-06-22",1.559272727]
["2013-06-23",2.169574468]
["2013-06-24",3]
["2013-06-25",3.6761538460000001]
["2013-06-26",2.7734375]
["2013-06-27",1.9763421050000001]
["2013-06-28",2.95]
["2013-06-29",1.076869565]
["2013-06-30",1.579590909]
["2013-07-01",0.65538461538461523]
["2013-07-02",0.56211214953271038]
["2013-07-03",0.61964705882352955]
["2013-07-04",1.3944615384615389]
["2013-07-05",0.42687378640776708]
["2013-07-06",0.4315590551181101]
["2013-07-07",0]
["2013-07-08",1.7423728813559254E-2]
["2013-07-09",0]
["2013-07-10",0.206697247706422]
["2013-07-11",1.5694174757281554]
["2013-07-12",1.4483333333333333]
["2013-07-13",1.1475]
["2013-07-14",0.32770149253731329]
["2013-07-15",0]
["2013-07-16",0]
["2013-07-17",0]
["2013-07-18",0]
["2013-07-19",0]
["2013-07-20",0]
["2013-07-21",0]
["2013-07-22",0]
["2013-07-23",0]
["2013-07-24",0]
["2013-07-25",0]
["2013-07-26",0]
["2013-07-27",0]
["2013-07-28",3.8787878787878628E-2]
["2013-07-29",0.21545454545454545]
["2013-07-30",0.28224096385542152]
["2013-07-31",0]
["2013-08-01",0]
["2013-08-02",0]
["2013-08-03",0]
["2013-08-04",0.11783783783783783]
["2013-08-05",0.20164383561643859]
["2013-08-06",0.17951063829787248]
["2013-08-07",0.27663999999999955]
["2013-08-08",0.73439999999999994]
["2013-08-09",0.34260869565217389]
["2013-08-10",1.0348936170212766]
["2013-08-11",1.1338461538461537]
["2013-08-12",0.29181818181818175]
["2013-08-13",1.496275862068966]
["2013-08-14",1.4441652892561985]
["2013-08-15",0.58181818181818157]
["2013-08-16",0.28000000000000003]
["2013-08-17",0.20362831858407077]
["2013-08-18",0]
["2013-08-19",0.23672727272727237]
["2013-08-20",1.1520000000000001]
["2013-08-21",0.65131250000000018]
["2013-08-22",6.1871559633027706E-2]
["2013-08-23",0.23720547945205492]
["2013-08-24",6.3863636363636372E-2]
["2013-08-25",4.5]
["2013-08-26",1.7979999999999996]
["2013-08-27",0.45295384615384604]
["2013-08-28",0.54880434782608678]
["2013-08-29",0.70871578947368385]
["2013-08-30",1.0564587155963303]
["2013-08-31",0.12130434782608672]
["2013-09-01",1.9721999999999995]
["2013-09-02",1.66135593220339]
["2013-09-03",0.90269064748201455]
["2013-09-04",0.2317935483870969]
["2013-09-05",8.1121019108280346E-2]
["2013-09-06",0.19679999999999984]
["2013-09-07",1.8237272727272731]
["2013-09-08",1.226477272727273]
["2013-09-09",3.5999999999999996]
["2013-09-10",2.8999999999999986]
["2013-09-11",3.5499999999999989]
["2013-09-12",3.1999999999999993]
["2013-09-13",2.3957105263157898]
["2013-09-14",3.1500000000000004]
["2013-09-15",3.091739130434783]
["2013-09-16",4.5500000000000007]
["2013-09-17",4.7000000000000011]
["2013-09-18",1.5992307692307699]
["2013-09-19",4.0999999999999996]
["2013-09-20",1.0105263157894735]
["2013-09-21",2.3146603773584906]
["2013-09-22",0.77584000000000009]
["2013-09-23",0.58986666666666687]
["2013-09-24",1.5016959999999999]
["2013-09-25",1.3245439999999995]
["2013-09-26",0.15241379310344827]
["2013-09-27",0.71353191489361678]
["2013-09-28",0.30426229508196762]
["2013-09-29",0.47940298507462664]
["2013-09-30",1.1619512195121948]
["2013-10-01",0.79659090909090935]
["2013-10-02",1.0504347826086957]
["2013-10-03",0.66954545454545444]
["2013-10-04",0.26173333333333354]
["2013-10-05",0.83174193548387088]
["2013-10-06",1.3870000000000002]
["2013-10-07",1.8583333333333334]
["2013-10-08",1.708]
["2013-10-09",2.75]
["2013-10-10",8.0500000000000007]
["2013-10-11",8.25]
["2013-10-12",7.85]
["2013-10-13",8.5500000000000007]
["2013-10-14",5.9]
["2013-10-15",5.0500000000000007]
["2013-10-16",6.25]
["2013-10-17",3.67993023255814]
["2013-10-18",4.75]
["2013-10-19",3.3828571428571426]
["2013-10-20",1.798875]
["2013-10-21",1.946619718309859]
["2013-10-22",0.9704615384615386]
["2013-10-23",0.49659090909090858]
["2013-10-24",3.5500000000000007]
["2013-10-25",1.5887499999999999]
["2013-10-26",0.64845283018867961]
["2013-10-27",2.6500000000000004]
["2013-10-28",2.9000000000000004]
["2013-10-29",6.15]
["2013-10-30",7.8000000000000007]
["2013-10-31",8.4499999999999993]
["2013-11-01",6.1999999999999993]
["2013-11-02",5.3999999999999986]
["2013-11-03",7.25]
["2013-11-04",6.8000000000000007]
["2013-11-05",9.4]
["2013-11-06",4.25]
["2013-11-07",2.6499999999999986]
["2013-11-08",5.4499999999999993]
["2013-11-09",9.9499999999999993]
["2013-11-10",9.35]
["2013-11-11",11.4]
["2013-11-12",8.9]
["2013-11-13",9.1999999999999993]
["2013-11-14",11.4]
["2013-11-15",9.6]
["2013-11-16",14.25]
["2013-11-17",13.45]
["2013-11-18",12]
["2013-11-19",12.1]
["2013-11-20",13.6]
["2013-11-21",14.45]
["2013-11-22",14]
["2013-11-23",12.05]
["2013-11-24",12.399999999999999]
["2013-11-25",11.45]
["2013-11-26",12.1]
["2013-11-27",11.35]
["2013-11-28",13.2]
["2013-11-29",9.65]
["2013-11-30",10.65]
["2013-12-01",11.5]
["2013-12-02",10.8]
["2013-12-03",13.35]
["2013-12-04",12.850000000000001]
["2013-12-05",10.45]
["2013-12-06",10.65]
["2013-12-07",10.55]
["2013-12-08",9.4499999999999993]
["2013-12-09",13.45]
["2013-12-10",14]
["2013-12-11",15.1]
["2013-12-12",16.45]
["2013-12-13",14.9]
["2013-12-14",10.5]
["2013-12-15",10.15]
["2013-12-16",10.7]
["2013-12-17",11.25]
["2013-12-18",8.8000000000000007]
["2013-12-19",9.6]
["2013-12-20",11.100000000000001]
["2013-12-21",11.95]
["2013-12-22",10.35]
["2013-12-23",8.8000000000000007]
["2013-12-24",7.6999999999999993]
["2013-12-25",10.050000000000001]
["2013-12-26",10.95]
["2013-12-27",9]
["2013-12-28",10]
["2013-12-29",11.15]
["2013-12-30",13.45]
["2013-12-31",10.45]
["2014-01-01",9.15]
["2014-01-02",8.1]
["2014-01-03",6.6]
["2014-01-04",7.85]
["2014-01-05",9.8000000000000007]
["2014-01-06",7.2]
["2014-01-07",6.5]
["2014-01-08",6.85]
["2014-01-09",7.2]
["2014-01-10",12.2]
["2014-01-11",10.45]
["2014-01-12",12.55]
["2014-01-13",9.8000000000000007]
["2014-01-14",11.4]
["2014-01-15",12]
["2014-01-16",9.0500000000000007]
["2014-01-17",8.9499999999999993]
["2014-01-18",10.5]
["2014-01-19",10]
["2014-01-20",11]
["2014-01-21",15]
["2014-01-22",14.25]
["2014-01-23",11]
["2014-01-24",11.65]
["2014-01-25",11.2]
["2014-01-26",10.55]
["2014-01-27",12.2]
["2014-01-28",13]
["2014-01-29",13.35]
["2014-01-30",12.2]
["2014-01-31",12.85]
["2014-02-01",10.35]
["2014-02-02",11.95]
["2014-02-03",12.95]
["2014-02-04",11]
["2014-02-05",10.35]
["2014-02-06",8.4499999999999993]
["2014-02-07",8.25]
["2014-02-08",10.45]
["2014-02-09",11.1]
["2014-02-10",10.75]
["2014-02-11",12.4]
["2014-02-12",12.2]
["2014-02-13",10.65]
["2014-02-14",9.35]
["2014-02-15",7.85]
["2014-02-16",9.9499999999999993]
["2014-02-17",10.1]
["2014-02-18",10.95]
["2014-02-19",8.75]
["2014-02-20",8.1999999999999993]
["2014-02-21",9.4499999999999993]
["2014-02-22",10.8]
["2014-02-23",8.9499999999999993]
["2014-02-24",8.3000000000000007]
["2014-02-25",7.2]
["2014-02-26",9.75]
["2014-02-27",10.85]
["2014-02-28",10.55]
["2014-03-01",10.9]
["2014-03-02",12.15]
["2014-03-03",11.05]
["2014-03-04",9.65]
["2014-03-05",8.9499999999999993]
["2014-03-06",8.4]
["2014-03-07",7.9]
["2014-03-08",5.8483333330000002]
["2014-03-09",4.5508800000000003]
["2014-03-10",3.7232941180000001]
["2014-03-11",5.55]
["2014-03-12",5.2583925230000004]
["2014-03-13",4.4673749999999997]
["2014-03-14",4.4388644069999996]
["2014-03-15",6.75]
["2014-03-16",5.3773451330000004]
["2014-03-17",8.8000000000000007]
["2014-03-18",7.1]
["2014-03-19",5.7]
["2014-03-20",5.1024657529999997]
["2014-03-21",6.6]
["2014-03-22",7.4]
["2014-03-23",10.3]
["2014-03-24",10.75]
["2014-03-25",11.4]
["2014-03-26",9.5500000000000007]
["2014-03-27",9.9499999999999993]
["2014-03-28",7.55]
["2014-03-29",4.2955970150000002]
["2014-03-30",3.6110322579999998]
["2014-03-31",3.5289736839999999]
["2014-04-01",3.0619354840000002]
["2014-04-02",2.916176471]
["2014-04-03",2.8205671639999998]
["2014-04-04",5.05]
["2014-04-05",4.251176471]
["2014-04-06",2.2449230770000002]
["2014-04-07",1.714336283]
["2014-04-08",6.65]
["2014-04-09",6.1]
["2014-04-10",4.3050781249999996]
["2014-04-11",4.0724242420000003]
["2014-04-12",5.0999999999999996]
["2014-04-13",6.2]
["2014-04-14",5.55]
["2014-04-15",7.45]
["2014-04-16",6.45]
["2014-04-17",4.6707284769999999]
["2014-04-18",4.5999999999999996]
["2014-04-19",7.65]
["2014-04-20",3.8083505149999999]
["2014-04-21",4.55]
["2014-04-22",2.5670000000000002]
["2014-04-23",3.4615]
["2014-04-24",2.1662650600000002]
["2014-04-25",3.9]
["2014-04-26",7.3]
["2014-04-27",6.65]
["2014-04-28",5.55]
["2014-04-29",7]
["2014-04-30",3.9398139529999998]
["2014-05-01",4.8999999999999986]
["2014-05-02",4.9499999999999993]
["2014-05-03",6.3999999999999986]
["2014-05-04",5.7983999999999991]
["2014-05-05",3.3291666666666671]
["2014-05-06",1.7084999999999997]
["2014-05-07",3.3000000000000007]
["2014-05-08",4.75]
["2014-05-09",1.7352615384615386]
["2014-05-10",3.1586461538461537]
["2014-05-11",5.8999999999999986]
["2014-05-12",6.5]
["2014-05-13",6.3000000000000007]
["2014-05-14",4.6333749999999991]
["2014-05-15",5.25]
["2014-05-16",4.1116935483870964]
["2014-05-17",2.5643870967741935]
["2014-05-18",1.5880458015267176]
["2014-05-19",1.235590909090909]
["2014-05-20",1.2820810810810808]
["2014-05-21",2.088000000000001]
["2014-05-22",2.9152639999999992]
["2014-05-23",3.7442022471910108]
["2014-05-24",4.8000000000000007]
["2014-05-25",3.5423157894736845]
["2014-05-26",2.9000000000000004]
["2014-05-27",3.3000000000000007]
["2014-05-28",3.6500000000000004]
["2014-05-29",2.8735384615384616]
["2014-05-30",1.2449090909090903]
["2014-05-31",1.9997391304347834]
["2014-06-01",3.1324999999999998]
["2014-06-02",2.0182972970000002]
["2014-06-03",1.1519999999999999]
["2014-06-04",3.1]
["2014-06-05",3.582300885]
["2014-06-06",1.484576471]
["2014-06-07",0]
["2014-06-08",0.21541463399999999]
["2014-06-09",0.10568316799999999]
["2014-06-10",0.25830434800000002]
["2014-06-11",0.12941176500000001]
["2014-06-12",0.46250000000000002]
["2014-06-13",0.64698181799999999]
["2014-06-14",0.51891891899999998]
["2014-06-15",2.1058064519999999]
["2014-06-16",2.2964516129999999]
["2014-06-17",2.0625833330000001]
["2014-06-18",1.4]
["2014-06-19",1.419417476]
["2014-06-20",1.233153846]
["2014-06-21",1.4196774190000001]
["2014-06-22",0.53133898300000004]
["2014-06-23",0.41787368400000002]
["2014-06-24",0.50070588199999999]
["2014-06-25",0.77416867499999997]
["2014-06-26",1.253658537]
["2014-06-27",0.30223255799999998]
["2014-06-28",1.211733333]
["2014-06-29",1.9447741940000001]
["2014-06-30",1.6675555559999999]
["2014-07-01",0.59818181818181848]
["2014-07-02",1.0464122137404579]
["2014-07-03",0.34270000000000017]
["2014-07-04",0]
["2014-07-05",0.11860273972602715]
["2014-07-06",1.1269811320754721]
["2014-07-07",1.6778666666666664]
["2014-07-08",1.1826315789473685]
["2014-07-09",2.75]
["2014-07-10",3.1999999999999993]
["2014-07-11",1.039220338983051]
["2014-07-12",0.58939024390243877]
["2014-07-13",0.16919999999999957]
["2014-07-14",1.076622641509434]
["2014-07-15",1.1085999999999998]
["2014-07-16",0]
["2014-07-17",0]
["2014-07-18",0]
["2014-07-19",0]
["2014-07-20",4.2666666666666478E-2]
["2014-07-21",0.12941176470588234]
["2014-07-22",1.884745762711857E-2]
["2014-07-23",4.7608695652173912E-2]
["2014-07-24",0]
["2014-07-25",0]
["2014-07-26",0]
["2014-07-27",0]
["2014-07-28",8.3439999999999889E-2]
["2014-07-29",0.50924590163934413]
["2014-07-30",0.1977499999999997]
["2014-07-31",0.6056585365853655]
["2014-08-01",0.16124193548387108]
["2014-08-02",3.9384615384615219E-2]
["2014-08-03",0.77471153846153851]
["2014-08-04",0.3531034482758621]
["2014-08-05",0.27000000000000013]
["2014-08-06",9.3418181818181692E-2]
["2014-08-07",0.12827586206896552]
["2014-08-08",0]
["2014-08-09",0.7228470588235294]
["2014-08-10",6.5379310344827773E-2]
["2014-08-11",1.0346987951807232]
["2014-08-12",1.7241686746987954]
["2014-08-13",0.95697368421052609]
["2014-08-14",1.6500000000000004]
["2014-08-15",1.6650602409638555]
["2014-08-16",1.2020792079207918]
["2014-08-17",1.5093243243243246]
["2014-08-18",1.308583333333333]
["2014-08-19",2.4747671232876716]
["2014-08-20",2.7261123595505619]
["2014-08-21",3.578823529411765]
["2014-08-22",1.7679999999999998]
["2014-08-23",2.1631999999999998]
["2014-08-24",2.85]
["2014-08-25",1.9499999999999993]
["2014-08-26",1.1124666666666667]
["2014-08-27",0.57499999999999996]
["2014-08-28",0.22637931034482772]
["2014-08-29",0.47634210526315807]
["2014-08-30",1.0750561797752811]
["2014-08-31",1.4503846153846154]
["2014-09-01",1.6529999999999996]
["2014-09-02",0.3859058823529411]
["2014-09-03",0.86040366972477078]
["2014-09-04",0.8617464788732393]
["2014-09-05",0]
["2014-09-06",5.5909090909090908E-2]
["2014-09-07",0.29920388349514537]
["2014-09-08",0.24838888888888874]
["2014-09-09",0.78972413793103469]
["2014-09-10",1.7680961538461537]
["2014-09-11",2.0788235294117645]
["2014-09-12",1.6789532710280373]
["2014-09-13",0.98783177570093428]
["2014-09-14",0.59399999999999975]
["2014-09-15",0.89435897435897438]
["2014-09-16",0.57614634146341459]
["2014-09-17",0.19350495049504926]
["2014-09-18",8.403846153846279E-3]
["2014-09-19",0.22664220183486264]
["2014-09-20",0.38553600000000005]
["2014-09-21",0.27712195121951239]
["2014-09-22",2.5386666666666668]
["2014-09-23",3.2977882352941177]
["2014-09-24",3.67993023255814]
["2014-09-25",2.8022325581395351]
["2014-09-26",3.1623529411764713]
["2014-09-27",1.2480000000000002]
["2014-09-28",1.3245439999999995]
["2014-09-29",0.48873846153846123]
["2014-09-30",0.9931818181818185]
["2014-10-01",0.98534653465346533]
["2014-10-02",0.42172602739726017]
["2014-10-03",0.84359999999999979]
["2014-10-04",1.6705511811023626]
["2014-10-05",4.8500000000000014]
["2014-10-06",6.0500000000000007]
["2014-10-07",3.8499999999999996]
["2014-10-08",2.6553488372093024]
["2014-10-09",1.3381818181818181]
["2014-10-10",3.1999999999999993]
["2014-10-11",1.8256562499999998]
["2014-10-12",4.5]
["2014-10-13",1.5896399999999997]
["2014-10-14",4.7676969696969698]
["2014-10-15",4.4499999999999993]
["2014-10-16",1.6224347826086958]
["2014-10-17",1.798875]
["2014-10-18",1.1622542372881353]
["2014-10-19",0.83781818181818168]
["2014-10-20",2.3999999999999986]
["2014-10-21",4.7999999999999989]
["2014-10-22",7.35]
["2014-10-23",5.65]
["2014-10-24",4.4499999999999993]
["2014-10-25",4.1499999999999986]
["2014-10-26",2.7188965517241379]
["2014-10-27",4.0783448275862062]
["2014-10-28",8.25]
["2014-10-29",4.6999999999999993]
["2014-10-30",2.6358518518518519]
["2014-10-31",1.6925806451612908]
["2014-11-01",2.8133818181818184]
["2014-11-02",2.6499999999999986]
["2014-11-03",4.75]
["2014-11-04",7.9]
["2014-11-05",8.9]
["2014-11-06",9.0500000000000007]
["2014-11-07",7.1]
["2014-11-08",6.8000000000000007]
["2014-11-09",7]
["2014-11-10",9.6999999999999993]
["2014-11-11",7.0500000000000007]
["2014-11-12",5.6]
["2014-11-13",7.1999999999999993]
["2014-11-14",7.85]
["2014-11-15",6.6999999999999993]
["2014-11-16",8]
["2014-11-17",8.65]
["2014-11-18",8.6999999999999993]
["2014-11-19",11.2]
["2014-11-20",9.35]
["2014-11-21",7.75]
["2014-11-22",6.9]
["2014-11-23",5.75]
["2014-11-24",7.3000000000000007]
["2014-11-25",7.75]
["2014-11-26",6.5500000000000007]
["2014-11-27",7.35]
["2014-11-28",5.8000000000000007]
["2014-11-29",9.4]
["2014-11-30",11.75]
["2014-12-01",14.05]
["2014-12-02",14.5]
["2014-12-03",15.15]
["2014-12-04",14.25]
["2014-12-05",12.95]
["2014-12-06",11.95]
["2014-12-07",14]
["2014-12-08",13.55]
["2014-12-09",12.7]
["2014-12-10",10.4]
["2014-12-11",10]
["2014-12-12",8.1]
["2014-12-13",13.65]
["2014-12-14",15.75]
["2014-12-15",14.6]
["2014-12-16",10.7]
["2014-12-17",8.5]
["2014-12-18",4.5999999999999996]
["2014-12-19",6.75]
["2014-12-20",9.1]
["2014-12-21",10.1]
["2014-12-22",8.6000000000000014]
["2014-12-23",9.5500000000000007]
["2014-12-24",8.8500000000000014]
["2014-12-25",10.199999999999999]
["2014-12-26",11.8]
["2014-12-27",12.55]
["2014-12-28",18.25]
["2014-12-29",16.899999999999999]
["2014-12-30",13.85]
["2014-12-31",12.3]
["2015-01-01",15.05]
["2015-01-02",11.25]
["2015-01-03",11]
["2015-01-04",12.7]
["2015-01-05",16.850000000000001]
["2015-01-06",15.95]
["2015-01-07",13.65]
["2015-01-08",10.050000000000001]
["2015-01-09",7.1]
["2015-01-10",5.75]
["2015-01-11",11.100000000000001]
["2015-01-12",10.199999999999999]
["2015-01-13",9.0500000000000007]
["2015-01-14",10.1]
["2015-01-15",9.1]
["2015-01-16",10.9]
["2015-01-17",12.75]
["2015-01-18",14.45]
["2015-01-19",15]
["2015-01-20",16.8]
["2015-01-21",16.55]
["2015-01-22",17.100000000000001]
["2015-01-23",16.600000000000001]
["2015-01-24",14.85]
["2015-01-25",13.850000000000001]
["2015-01-26",10.4]
["2015-01-27",11.85]
["2015-01-28",10.45]
["2015-01-29",12.5]
["2015-01-30",14.95]
["2015-01-31",14.1]
["2015-02-01",14.45]
["2015-02-02",15.7]
["2015-02-03",16.05]
["2015-02-04",15.55]
["2015-02-05",15.8]
["2015-02-06",17.75]
["2015-02-07",16]
["2015-02-08",12.6]
["2015-02-09",14.95]
["2015-02-10",13.649999999999999]
["2015-02-11",12]
["2015-02-12",14.95]
["2015-02-13",10.35]
["2015-02-14",10.6]
["2015-02-15",10.4]
["2015-02-16",11.3]
["2015-02-17",12.1]
["2015-02-18",14.05]
["2015-02-19",13.65]
["2015-02-20",11.3]
["2015-02-21",14.05]
["2015-02-22",13.05]
["2015-02-23",9.65]
["2015-02-24",11.6]
["2015-02-25",12.05]
["2015-02-26",8.75]
["2015-02-27",11.149999999999999]
["2015-02-28",12.2]
["2015-03-01",8.0500000000000007]
["2015-03-02",9.15]
["2015-03-03",10.45]
["2015-03-04",11.8]
["2015-03-05",10.85]
["2015-03-06",10.25]
["2015-03-07",8.9]
["2015-03-08",6.8249999999999993]
["2015-03-09",7.35]
["2015-03-10",7.1000000000000014]
["2015-03-11",7.6000000000000014]
["2015-03-12",8.1999999999999993]
["2015-03-13",9.6]
["2015-03-14",10.5]
["2015-03-15",11.6]
["2015-03-16",9.35]
["2015-03-17",6.1978947368421053]
["2015-03-18",5.5]
["2015-03-19",11]
["2015-03-20",8.5]
["2015-03-21",11.350000000000001]
["2015-03-22",9.3000000000000007]
["2015-03-23",9.5499999999999989]
["2015-03-24",10.95]
["2015-03-25",10.5]
["2015-03-26",12.399999999999999]
["2015-03-27",9.4499999999999993]
["2015-03-28",5.6499999999999986]
["2015-03-29",5.8500000000000014]
["2015-03-30",6.4499999999999993]
["2015-03-31",5.5]
["2015-04-01",9.1999999999999993]
["2015-04-02",8.35]
["2015-04-03",8.8000000000000007]
["2015-04-04",8.65]
["2015-04-05",10.35]
["2015-04-06",8.6999999999999993]
["2015-04-07",7.0500000000000007]
["2015-04-08",5.4488983050847457]
["2015-04-09",3.6187919463087246]
["2015-04-10",3.0428159999999997]
["2015-04-11",4.1500000000000004]
["2015-04-12",4.4661759999999999]
["2015-04-13",2.7174956521739131]
["2015-04-14",2.1935686274509805]
["2015-04-15",1.5725769230769233]
["2015-04-16",1.0558556701030926]
["2015-04-17",1.6645833333333331]
["2015-04-18",5.0999999999999996]
["2015-04-19",5.0117073170731707]
["2015-04-20",3.8808053691275171]
["2015-04-21",2.7888000000000002]
["2015-04-22",3.258805970149254]
["2015-04-23",3.7323]
["2015-04-24",3.8333749999999993]
["2015-04-25",2.3939240506329118]
["2015-04-26",4.3999999999999986]
["2015-04-27",6.1000000000000014]
["2015-04-28",7.85]
["2015-04-29",7.1999999999999993]
["2015-04-30",8.0500000000000007]
["2015-05-01",8.4]
["2015-05-02",6.3999999999999986]
["2015-05-03",2.1720232558139538]
["2015-05-04",3.0993684210526316]
["2015-05-05",1.5199999999999996]
["2015-05-06",4.7999999999999989]
["2015-05-07",5.3583853211009167]
["2015-05-08",2.8000198019801985]
["2015-05-09",1.5093243243243246]
["2015-05-10",1.6512941176470588]
["2015-05-11",0.95894366197183101]
["2015-05-12",0.96104918032786868]
["2015-05-13",2.576771653543307]
["2015-05-14",3]
["2015-05-15",5.1499999999999986]
["2015-05-16",4.4047115384615392]
["2015-05-17",3.9669421487603307]
["2015-05-18",3.6507058823529412]
["2015-05-19",6.2999999999999989]
["2015-05-20",7.15]
["2015-05-21",4.7974590163934421]
["2015-05-22",3.4731067961165047]
["2015-05-23",1.5342061855670099]
["2015-05-24",2.0335999999999994]
["2015-05-25",1.7864347826086955]
["2015-05-26",2.6047272727272728]
["2015-05-27",2.552479338842975]
["2015-05-28",2.0401369863013703]
["2015-05-29",2.5417647058823531]
["2015-05-30",3.1132978723404259]
["2015-05-31",2.5077966101694917]
["2015-06-01",4.5177872340425527]
["2015-06-02",1.2823529411764705]
["2015-06-03",1.1786265060240964]
["2015-06-04",1.4925925925925925]
["2015-06-05",4.6402439024390243E-2]
["2015-06-06",1.428953271028037]
["2015-06-07",2.1474358974358969]
["2015-06-08",2.8336146788990821]
["2015-06-09",2.7824]
["2015-06-10",1.9063281249999999]
["2015-06-11",0.19105263157894736]
["2015-06-12",0]
["2015-06-13",0.32969696969696971]
["2015-06-14",0.48910891089108899]
["2015-06-15",1.039220338983051]
["2015-06-16",1.7555999999999998]
["2015-06-17",1.3177727272727275]
["2015-06-18",0.27341176470588197]
["2015-06-19",1.65672]
["2015-06-20",1.2842061855670099]
["2015-06-21",0.33041095890410976]
["2015-06-22",2.179661016949153]
["2015-06-23",3.1569999999999996]
["2015-06-24",1.7008358208955223]
["2015-06-25",0.32999999999999979]
["2015-06-26",0.12036942675159255]
["2015-06-27",5.3124999999999999E-2]
["2015-06-28",0.45988387096774203]
["2015-06-29",0.12865600000000021]
["2015-06-30",0]
["2015-07-01",0]
["2015-07-02",0]
["2015-07-03",0]
["2015-07-04",0]
["2015-07-05",0]
["2015-07-06",0.24676249999999975]
["2015-07-07",0]
["2015-07-08",0.96787500000000037]
["2015-07-09",1.0057142857142856]
["2015-07-10",0.74264150943396223]
["2015-07-11",0.1211764705882353]
["2015-07-12",0.31200000000000011]
["2015-07-13",0]
["2015-07-14",0]
["2015-07-15",1.717482517482511E-2]
["2015-07-16",0]
["2015-07-17",0]
["2015-07-18",0]
["2015-07-19",0.31555555555555553]
["2015-07-20",0]
["2015-07-21",0]
["2015-07-22",0]
["2015-07-23",0.18465909090909105]
["2015-07-24",0.18683636363636338]
["2015-07-25",0.84155882352941169]
["2015-07-26",2.187024390243903]
["2015-07-27",0.6188684210526314]
["2015-07-28",2.0500000000000007]
["2015-07-29",1.9832258064516131]
["2015-07-30",2.0483846153846152]
["2015-07-31",1.9865289256198346]
["2015-08-01",0.7054999999999999]
["2015-08-02",0.74576331360946735]
["2015-08-03",1.6999999999999935E-2]
["2015-08-04",0.11249999999999977]
["2015-08-05",0.43240506329113931]
["2015-08-06",0]
["2015-08-07",0.26514925373134302]
["2015-08-08",8.4158415841585413E-3]
["2015-08-09",0]
["2015-08-10",7.3294117647058732E-2]
["2015-08-11",0]
["2015-08-12",0]
["2015-08-13",0]
["2015-08-14",2.8200000000000076E-2]
["2015-08-15",0.62338709677419368]
["2015-08-16",1.302740740740741]
["2015-08-17",0.63176119402985054]
["2015-08-18",1.0725000000000002]
["2015-08-19",0.91634999999999978]
["2015-08-20",0.22175999999999968]
["2015-08-21",0.2853731343283582]
["2015-08-22",8.3134328358210174E-3]
["2015-08-23",1.8999999999999923E-2]
["2015-08-24",0.66635294117647081]
["2015-08-25",2.4669090909090912]
["2015-08-26",0.366043165467626]
["2015-08-27",3.8000000000000007]
["2015-08-28",0.96385714285714308]
["2015-08-29",0.33017105263157909]
["2015-08-30",0]
["2015-08-31",0]
["2015-09-01",0.38700000000000018]
["2015-09-02",1.8285]
["2015-09-03",3.1061799999999997]
["2015-09-04",3.2999999999999989]
["2015-09-05",2.1149062499999993]
["2015-09-06",3.5]
["2015-09-07",3.3013861386138612]
["2015-09-08",2.2876363636363637]
["2015-09-09",2.0366666666666666]
["2015-09-10",1.8012941176470587]
["2015-09-11",2.0901692307692308]
["2015-09-12",0.75847999999999904]
["2015-09-13",2.0327500000000001]
["2015-09-14",2.1213114754098354]
["2015-09-15",2.6973947368421052]
["2015-09-16",2.0322173913043478]
["2015-09-17",1.1653181818181815]
["2015-09-18",3.1566206896551732]
["2015-09-19",2.4053999999999993]
["2015-09-20",3.3280000000000003]
["2015-09-21",4.3714956521739134]
["2015-09-22",3.3499999999999996]
["2015-09-23",3.9085249999999996]
["2015-09-24",4.0283953488372095]
["2015-09-25",2.6220294117647063]
["2015-09-26",3.8]
["2015-09-27",3.3680934579439259]
["2015-09-28",3.4505161290322586]
["2015-09-29",3.4811521739130433]
["2015-09-30",3.9286153846153851]
["2015-10-01",4.7999999999999989]
["2015-10-02",4.0590000000000002]
["2015-10-03",2.774]
["2015-10-04",5.65]
["2015-10-05",2.9499999999999993]
["2015-10-06",0.86964705882352955]
["2015-10-07",3.0999999999999996]
["2015-10-08",4.25]
["2015-10-09",5.35]
["2015-10-10",4.0281290322580645]
["2015-10-11",5.5499999999999989]
["2015-10-12",5.6]
["2015-10-13",7.6499999999999986]
["2015-10-14",10.9]
["2015-10-15",11.75]
["2015-10-16",11.55]
["2015-10-17",7.4499999999999993]
["2015-10-18",7.8500000000000014]
["2015-10-19",8.8000000000000007]
["2015-10-20",6.6]
["2015-10-21",7]
["2015-10-22",5.1999999999999993]
["2015-10-23",5.1999999999999993]
["2015-10-24",5.3500000000000014]
["2015-10-25",5.25]
["2015-10-26",6.25]
["2015-10-27",2.4655555555555555]
["2015-10-28",5]
["2015-10-29",5.6999999999999993]
["2015-10-30",5.6]
["2015-10-31",5.0999999999999996]
["2015-11-01",4.6985913043478265]
["2015-11-02",9.8000000000000007]
["2015-11-03",5.3999999999999986]
["2015-11-04",3.3499999999999996]
["2015-11-05",2.6569354838709676]
["2015-11-06",1.2899999999999996]
["2015-11-07",0.81272727272727263]
["2015-11-08",1.0426666666666671]
["2015-11-09",2.0500000000000007]
["2015-11-10",5.5500000000000007]
["2015-11-11",6.1]
["2015-11-12",5.25]
["2015-11-13",3.9499999999999993]
["2015-11-14",8.15]
["2015-11-15",3.4000000000000004]
["2015-11-16",4.3499999999999996]
["2015-11-17",2.75]
["2015-11-18",4.5500000000000007]
["2015-11-19",3.6000000000000014]
["2015-11-20",7.75]
["2015-11-21",12.5]
["2015-11-22",13.25]
["2015-11-23",13.649999999999999]
["2015-11-24",13.05]
["2015-11-25",10.25]
["2015-11-26",10.7]
["2015-11-27",13.350000000000001]
["2015-11-28",10.3]
["2015-11-29",7.1999999999999993]
["2015-11-30",6.15]
["2015-12-01",5.3500000000000014]
["2015-12-02",6.6999999999999993]
["2015-12-03",8.9]
["2015-12-04",8.3999999999999986]
["2015-12-05",11.8]
["2015-12-06",8.5]
["2015-12-07",6.4]
["2015-12-08",8.85]
["2015-12-09",9.25]
["2015-12-10",14.2]
["2015-12-11",11.75]
["2015-12-12",7.8000000000000007]
["2015-12-13",11.8]
["2015-12-14",12.3]
["2015-12-15",8.8000000000000007]
["2015-12-16",5.35]
["2015-12-17",4.5500000000000007]
["2015-12-18",5.75]
["2015-12-19",6]
["2015-12-20",5.5]
["2015-12-21",6.35]
["2015-12-22",4.6499999999999986]
["2015-12-23",6.0500000000000007]
["2015-12-24",7.6]
["2015-12-25",6.4499999999999993]
["2015-12-26",7]
["2015-12-27",7.85]
["2015-12-28",9.6]
["2015-12-29",7.4499999999999993]
["2015-12-30",9.0500000000000007]
["2015-12-31",8.0500000000000007]
["2016-01-01",11.4]
["2016-01-02",9.1]
["2016-01-03",10.75]
["2016-01-04",9.85]
["2016-01-05",10.4]
["2016-01-06",9.25]
["2016-01-07",8.65]
["2016-01-08",12]
["2016-01-09",10.15]
["2016-01-10",11.35]
["2016-01-11",11.5]
["2016-01-12",10.95]
["2016-01-13",12.5]
["2016-01-14",12.35]
["2016-01-15",13.9]
["2016-01-16",14.45]
["2016-01-17",14.25]
["2016-01-18",17.95]
["2016-01-19",18.350000000000001]
["2016-01-20",20.399999999999999]
["2016-01-21",18.2]
["2016-01-22",14.5]
["2016-01-23",11.6]
["2016-01-24",9.35]
["2016-01-25",8.5]
["2016-01-26",8.25]
["2016-01-27",6.9]
["2016-01-28",9.0500000000000007]
["2016-01-29",11.3]
["2016-01-30",9.5500000000000007]
["2016-01-31",7.65]
["2016-02-01",5.6]
["2016-02-02",7.3999999999999986]
["2016-02-03",10.9]
["2016-02-04",10.050000000000001]
["2016-02-05",7.6000000000000014]
["2016-02-06",7.6]
["2016-02-07",8.5]
["2016-02-08",8.85]
["2016-02-09",9.35]
["2016-02-10",11.95]
["2016-02-11",11.55]
["2016-02-12",14.3]
["2016-02-13",11.399999999999999]
["2016-02-14",11.1]
["2016-02-15",12.5]
["2016-02-16",14.3]
["2016-02-17",16.25]
["2016-02-18",16.100000000000001]
["2016-02-19",12.45]
["2016-02-20",8.9499999999999993]
["2016-02-21",6.0500000000000007]
["2016-02-22",6.75]
["2016-02-23",10.6]
["2016-02-24",13.15]
["2016-02-25",13.399999999999999]
["2016-02-26",14.15]
["2016-02-27",13.45]
["2016-02-28",13.8]
["2016-02-29",13.5]
["2016-03-01",11.9]
["2016-03-02",11.65]
["2016-03-03",11.3]
["2016-03-04",10.9]
["2016-03-05",13.55]
["2016-03-06",12.3]
["2016-03-07",13.3]
["2016-03-08",11.95]
["2016-03-09",11.15]
["2016-03-10",10.8]
["2016-03-11",9.8000000000000007]
["2016-03-12",10.199999999999999]
["2016-03-13",11.25]
["2016-03-14",11.8]
["2016-03-15",10.050000000000001]
["2016-03-16",12]
["2016-03-17",9.9]
["2016-03-18",10.55]
["2016-03-19",11.9]
["2016-03-20",11.95]
["2016-03-21",10.25]
["2016-03-22",7.85]
["2016-03-23",10.1]
["2016-03-24",8.6999999999999993]
["2016-03-25",6.85]
["2016-03-26",6.8]
["2016-03-27",7.6]
["2016-03-28",7]
["2016-03-29",7.6]
["2016-03-30",9]
["2016-03-31",11.1]
["2016-04-01",8.9]
["2016-04-02",10.6]
["2016-04-03",3.2552066119999998]
["2016-04-04",4.4000000000000004]
["2016-04-05",4.0999999999999996]
["2016-04-06",6.15]
["2016-04-07",9.0500000000000007]
["2016-04-08",7.55]
["2016-04-09",8.6]
["2016-04-10",6.9171830989999998]
["2016-04-11",5]
["2016-04-12",6.4]
["2016-04-13",4.5]
["2016-04-14",4.8]
["2016-04-15",5.15]
["2016-04-16",5.4]
["2016-04-17",9.1]
["2016-04-18",8.4499999999999993]
["2016-04-19",6.3]
["2016-04-20",4.5549076919999996]
["2016-04-21",2.3422222220000002]
["2016-04-22",2.85]
["2016-04-23",8.15]
["2016-04-24",11.4]
["2016-04-25",9.9499999999999993]
["2016-04-26",11.3]
["2016-04-27",10.9]
["2016-04-28",10.35]
["2016-04-29",7.85]
["2016-04-30",9.8000000000000007]
["2016-05-01",7.3000002000000004]
["2016-05-02",5.0612421550000004]
["2016-05-03",4.8999996000000001]
["2016-05-04",4.9455999999999998]
["2016-05-05",3.1623527650000001]
["2016-05-06",2.2702623019999999]
["2016-05-07",1.0284111460000001]
["2016-05-08",1.2015266929999999]
["2016-05-09",0.19847836399999999]
["2016-05-10",1.3754543539999999]
["2016-05-11",2.0820426479999998]
["2016-05-12",1.7071997219999999]
["2016-05-13",0.98444193499999999]
["2016-05-14",5.6500000950000002]
["2016-05-15",6.6999995500000002]
["2016-05-16",4.6500000950000002]
["2016-05-17",4.4692522419999996]
["2016-05-18",3.3000001999999999]
["2016-05-19",4.7000002949999997]
["2016-05-20",2.3146603560000001]
["2016-05-21",1.2536585920000001]
["2016-05-22",2.6500005999999998]
["2016-05-23",4.8000002000000004]
["2016-05-24",5.3000001900000004]
["2016-05-25",4.0589996099999999]
["2016-05-26",1.9205774659999999]
["2016-05-27",1.065263021]
["2016-05-28",0.586560148]
["2016-05-29",1.7999997000000001]
["2016-05-30",4.7000003000000001]
["2016-05-31",4.5500002000000004]
["2016-06-01",2.5]
["2016-06-02",4.9000000000000004]
["2016-06-03",5.5]
["2016-06-04",3]
["2016-06-05",1.4]
["2016-06-06",0.7]
["2016-06-07",0.1]
["2016-06-08",0.6]
["2016-06-09",1.5]
["2016-06-10",0.5]
["2016-06-11",0.3]
["2016-06-12",0.8]
["2016-06-13",2.2999999999999998]
["2016-06-14",1.2]
["2016-06-15",2.1]
["2016-06-16",1.9]
["2016-06-17",1.7]
["2016-06-18",1.6]
["2016-06-19",1.1000000000000001]
["2016-06-20",2]
["2016-06-21",0.3]
["2016-06-22",0]
["2016-06-23",0]
["2016-06-24",0]
["2016-06-25",0.9]
["2016-06-26",1.7]
["2016-06-27",0.6]
["2016-06-28",0.6]
["2016-06-29",1]
["2016-06-30",0.2]