{"text_format":"1","workbook":"xlsx","n_sheets":6,"sheets":["Feuil1","Feuil2","calcul","Aide","données","sauvegarde"],"not_rendered":{"charts":3,"images":13,"macros":1,"external_links":0,"defined_names":29,"comments":0,"pivot_tables":0},"unopened":[],"bounds":{"document_bytes":16777216,"sheet_cells":100000,"rows_first":2000,"rows_last":500,"rows_between":2000,"halvings":0,"cell_chars":16384,"cell_head_chars":4096},"cells_cut":0,"cells_raw":0,"read":"whole","date_system":"1900"}

{"sheet":"Feuil1","index":0,"n_rows":0,"n_cols":0,"rows_kept":0,"cut":false,"hidden":false,"merged":[]}

{"sheet":"Feuil2","index":1,"n_rows":0,"n_cols":0,"rows_kept":0,"cut":false,"hidden":true,"merged":[]}

{"sheet":"calcul","index":2,"n_rows":19,"n_cols":33,"rows_kept":19,"cut":false,"hidden":true,"merged":[[3,11,3,12]]}
[]
[]
[]
[null,null,null,"lambda\nw/m.K","/","épaisseur\ncm","=","U\nw/m².k","R =1/U\nm².k/w","dephasage\nheures","Poids\nKg/m²",{"$f":"IF(OR(COUNTIF($C$6:$C$15,\"Ossature bois 1\" )>0,COUNTIF($C$6:$C$15,\"Ossature bois 2\" )>0,COUNTIF($C$6:$C$15,\"Ossature bois 3\" )>0),\"Ossature\",\"\")","v":"Ossature"},null,{"$f":"IF(OR(COUNTIF($C$6:$C$15,\"Ossature bois 1\" )>0,COUNTIF($C$6:$C$15,\"Ossature bois 2\" )>0,COUNTIF($C$6:$C$15,\"Ossature bois 3\" )>0),\"Remplissage\",\"\")","v":"Remplissage"},{"$f":"IF(OR(COUNTIF($C$6:$C$15,\"Ossature bois 1\" )>0,COUNTIF($C$6:$C$15,\"Ossature bois 2\" )>0,COUNTIF($C$6:$C$15,\"Ossature bois 3\" )>0),\"(λ isolant)\",\"\")","v":"(λ isolant)"},null,"Niveau","T°C interface","pour graphe","Pvsat (Pa)","Pv (Pa)","Sd (m)","Z","Pvsat (normé)","Pv brut (normé)","Pv (normé)","Condensation","T°C interface pour hiver","Pvsat (Pa) pour hiver","Pv pour hiver","Plus grande diff hiver"]
[null,20,0.5,null,null,null,null,null,{"$f":"IF(H16=\"plancher\",0.7,IF(H16=\"toit\",0.1,0.13))","v":0.13},"Résistance superficielle",null,null,null,null,null,null,0,{"$f":"IF(ISERR($I5),NA(),$B$5-($B$5-$B$16)/$F$19*SUM($I$5:$I5))","v":19.612175106376771},{"$f":"R5","v":19.612175106376771},{"$f":"IF($R5<0,4.688*(1.486+$R5/100)^12.3,288.58*(1.098+$R5/100)^8.02)","v":2281.9536841936483},{"$f":"T5*C5","v":1140.9768420968242},null,"m²sPa/kg",{"$f":"T5/$T$5*30+25","v":55},{"$f":"U5/$T$5*30+25","v":40},null,{"$f":"MATCH(TRUE,AA6:AA15,0)","v":2},{"$f":"IF(ISERR($I5),NA(),20-30/$F$19*SUM($I$5:$I5))","v":19.612175106376771},{"$f":"IF($R5<0,4.688*(1.486+$R5/100)^12.3,288.58*(1.098+$R5/100)^8.02)","v":2281.9536841936483},{"$f":"AC5*50%","v":1140.9768420968242},{"$f":"AC5-AD5","v":1140.9768420968242},"Min",{"$f":"MIN(IF(NOT(ISERROR(AE5:AE16)),(AE5:AE16),0))","v":-244.94799894037851}]
[null,"Panneaux","Plaque plâtre BA...",{"$f":"IF(B6=\"Films\",\"-\",VLOOKUP(C6,données,5,0))","v":0.25},{"$f":"NOT(OR(B6=\"Films\",C6=\"\"))","v":true},1.3,{"$f":"AND(C6<>\"\",OR(D6=\"-\", ISNUMBER(D6)),ISNUMBER(F6))","v":true},{"$f":"IF(E6,D6/(F6/100),\"-\")","v":19.23076923076923},{"$f":"IF(E6,1/H6,\"-\")","v":5.2000000000000005E-2},{"$f":"IF(E6,1.38*F6/100*SQRT(VLOOKUP($C6,données,3,0)*VLOOKUP($C6,données,4,0)/D6),\"-\")","v":0.54532878743011537},{"$f":"IF(E6,VLOOKUP(C6,données,3,0)*F6/100,\"-\")","v":10.725},600,45,null,{"$f":"(IF(N6<>\"\",VLOOKUP(N6,données,5,0),\"\"))","v":""},null,{"$f":"IF(AND(ISNUMBER(F6),NOT(ISERROR(H6))),F6+Q5,NA())","v":1.3},{"$f":"IF(ISERR($I6),NA(),$B$5-($B$5-$B$16)/$F$19*SUM($I$5:$I6))","v":19.457045148927477},{"$f":"IF(F6>1.5,R6,NA())","v":{"$error":"#N/A"}},{"$f":"IF($R6<0,4.688*(1.486+$R6/100)^12.3,288.58*(1.098+$R6/100)^8.02)","v":2260.1075310430097},{"$f":"$U$5-($U$5-$U$16)/$W$16*SUM($W$6:$W6)","v":1127.8708363820836},{"$f":"IF(B6=\"Films\",VLOOKUP(calcul!C6,données,6,0),F6/100*VLOOKUP(calcul!C6,données,6,0))","v":9.1000000000000011E-2},{"$f":"5.4*1000000000*V6","v":491400000.00000006},{"$f":"T6/$T$5*30+25","v":54.712796714911967},39.827700196473899,null,{"$f":"IF(OR(ISERROR(Y6),ISERROR(X6)),FALSE,Y6>X6)","v":false},{"$f":"IF(ISERR($I6),NA(),20-30/$F$19*SUM($I$5:$I6))","v":19.457045148927477},{"$f":"IF($R6<0,4.688*(1.486+$R6/100)^12.3,288.58*(1.098+$R6/100)^8.02)","v":2260.1075310430097},{"$f":"$AD$5-($AD$5-$AD$16)/$W$16*SUM($W$6:$W6)","v":1127.8708363820836},{"$f":"AC6-AD6","v":1132.2366946609261},"Couche",{"$f":"MATCH(AG5,AE6:AE15,0)","v":2}]
[null,"Ossature_bois","Ossature bois 1",4.7416666666666669E-2,true,24,{"$f":"AND(C7<>\"\",OR(D7=\"-\", ISNUMBER(D7)),ISNUMBER(F7))","v":true},{"$f":"IF(E7,D7/(F7/100),\"-\")","v":0.19756944444444446},{"$f":"IF(E7,1/H7,\"-\")","v":5.0615114235500878},9.5486323513932501,22.9,600,45,"cellulose",3.9E-2,null,{"$f":"IF(AND(ISNUMBER(F7),NOT(ISERROR(H7))),F7+Q6,NA())","v":25.3},{"$f":"IF(ISERR($I7),NA(),$B$5-($B$5-$B$16)/$F$19*SUM($I$5:$I7))","v":4.3571979996115093},{"$f":"IF(F7>1.5,R7,NA())","v":4.3571979996115093},834.53143172573959,{"$f":"$U$5-($U$5-$U$16)/$W$16*SUM($W$6:$W7)","v":1079.4794306661181},{"$f":"IF(B7=\"Films\",VLOOKUP(calcul!C7,données,6,0),F7/100*VLOOKUP(calcul!C7,données,6,0))","v":0.33599999999999997},{"$f":"5.4*1000000000*V7","v":1814399999.9999998},{"$f":"T7/$T$5*30+25","v":35.971275677148064},39.191516306531391,null,true,{"$f":"IF(ISERR($I7),NA(),20-30/$F$19*SUM($I$5:$I7))","v":4.3571979996115093},834.53143172573959,{"$f":"$AD$5-($AD$5-$AD$16)/$W$16*SUM($W$6:$W7)","v":1079.4794306661181},-244.94799894037851,"Sat (g/s)",{"$f":"1000*(AD5-OFFSET(AC5,AG6,0))/SUM(W6:OFFSET(W5,AG6,0))-(OFFSET(AC5,AG6,0)-AD16)/(W16-SUM(W6:OFFSET(W5,AG6,0)))","v":1.3288281520408584E-4}]
[null,"Films","Freine vapeur (Sd=5m)","-",{"$f":"NOT(OR(B8=\"Films\",C8=\"\"))","v":false},0.4,true,"-","-","-","-",600,45,null,"",null,25.7,{"$f":"IF(ISERR($I8),NA(),$B$5-($B$5-$B$16)/$F$19*SUM($I$5:$I8))","v":4.3571979996115093},{"$error":"#N/A"},834.53143172573959,{"$f":"$U$5-($U$5-$U$16)/$W$16*SUM($W$6:$W8)","v":359.36922655948854},{"$f":"IF(B8=\"Films\",VLOOKUP(calcul!C8,données,6,0),F8/100*VLOOKUP(calcul!C8,données,6,0))","v":5},27000000000,35.971275677148064,29.724494134767795,null,false,{"$f":"IF(ISERR($I8),NA(),20-30/$F$19*SUM($I$5:$I8))","v":4.3571979996115093},834.53143172573959,{"$f":"$AD$5-($AD$5-$AD$16)/$W$16*SUM($W$6:$W8)","v":359.36922655948854},475.16220516625106,"temps (jours)",60]
[null,"Ossature_bois","Ossature bois 2",4.7416666666666669E-2,{"$f":"NOT(OR(B9=\"Films\",C9=\"\"))","v":true},18,true,0.26342592592592595,3.7961335676625656,7.1614742635449362,17.175000000000001,600,45,"cellulose",3.9E-2,null,43.7,{"$f":"IF(ISERR($I9),NA(),$B$5-($B$5-$B$16)/$F$19*SUM($I$5:$I9))","v":-6.967687362375468},-6.967687362375468,339.06617404687688,{"$f":"$U$5-($U$5-$U$16)/$W$16*SUM($W$6:$W9)","v":323.07567227251445},{"$f":"IF(B9=\"Films\",VLOOKUP(calcul!C9,données,6,0),F9/100*VLOOKUP(calcul!C9,données,6,0))","v":0.252},1360800000,29.457577422304556,29.247356217310912,null,false,{"$f":"IF(ISERR($I9),NA(),20-30/$F$19*SUM($I$5:$I9))","v":-6.967687362375468},339.06617404687688,{"$f":"$AD$5-($AD$5-$AD$16)/$W$16*SUM($W$6:$W9)","v":323.07567227251445},15.990501774362428,"Qsat ",{"$f":"AG7*AG8*24*3600","v":688.86451401798104}]
[null,"Panneaux","Panneau OSB",0.13,true,1,true,13,7.6923076923076927E-2,0.66897982032345338,6.5,600,45,null,"",null,44.7,{"$f":"IF(ISERR($I10),NA(),$B$5-($B$5-$B$16)/$F$19*SUM($I$5:$I10))","v":-7.1971695479513436},{"$error":"#N/A"},332.37034461525195,{"$f":"$U$5-($U$5-$U$16)/$W$16*SUM($W$6:$W10)","v":222.26024369758625},{"$f":"IF(B10=\"Films\",VLOOKUP(calcul!C10,données,6,0),F10/100*VLOOKUP(calcul!C10,données,6,0))","v":0.70000000000000007},3780000000.0000005,29.369549832463385,27.921973113264009,null,false,{"$f":"IF(ISERR($I10),NA(),20-30/$F$19*SUM($I$5:$I10))","v":-7.1971695479513436},332.37034461525195,{"$f":"$AD$5-($AD$5-$AD$16)/$W$16*SUM($W$6:$W10)","v":222.26024369758625},110.1101009176657,"Dp été",{"$f":"288.58*(1.098+12/100)^8.02*30%","v":420.99674296638625}]
[null,"Films","Pare-pluie (Sd=0,1)","-",false,0.4,true,"-","-","-","-",600,45,null,"",null,45.1,{"$f":"IF(ISERR($I11),NA(),$B$5-($B$5-$B$16)/$F$19*SUM($I$5:$I11))","v":-7.1971695479513436},{"$error":"#N/A"},332.37034461525195,{"$f":"$U$5-($U$5-$U$16)/$W$16*SUM($W$6:$W11)","v":207.85803961545366},{"$f":"IF(B11=\"Films\",VLOOKUP(calcul!C11,données,6,0),F11/100*VLOOKUP(calcul!C11,données,6,0))","v":0.1},540000000,29.369549832463385,27.732632669828735,null,false,{"$f":"IF(ISERR($I11),NA(),20-30/$F$19*SUM($I$5:$I11))","v":-7.1971695479513436},332.37034461525195,{"$f":"$AD$5-($AD$5-$AD$16)/$W$16*SUM($W$6:$W11)","v":207.85803961545366},124.51230499979829,"Evap (g/s)",{"$f":"1000*(AG10/SUM(W6:OFFSET(W5,AG6,0))+AG10/(W16-OFFSET(W5,AG6,0)))","v":1.952728803663491E-4}]
[null,"Bardage_ventile","Forfait RT 2005 : R=0,13",5.5585405789316943E-2,true,5,true,1.1117081157863389,0.89951668589976519,2.9266359327968284E-3,5.0000000000000001E-4,600,45,null,"",null,50.1,{"$f":"IF(ISERR($I12),NA(),$B$5-($B$5-$B$16)/$F$19*SUM($I$5:$I12))","v":-9.8806692635005504},-9.8806692635005504,262.58657380747871,{"$f":"$U$5-($U$5-$U$16)/$W$16*SUM($W$6:$W12)","v":207.85731950524962},{"$f":"IF(B12=\"Films\",VLOOKUP(calcul!C12,données,6,0),F12/100*VLOOKUP(calcul!C12,données,6,0))","v":5.0000000000000004E-6},27000.000000000004,28.452128440988929,27.732623202806565,null,false,{"$f":"IF(ISERR($I12),NA(),20-30/$F$19*SUM($I$5:$I12))","v":-9.8806692635005504},262.58657380747871,{"$f":"$AD$5-($AD$5-$AD$16)/$W$16*SUM($W$6:$W12)","v":207.85731950524962},54.729254302229094,"temps (jours)",90]
[null,null,null,{"$error":"#N/A"},false,"-",{"$error":"#N/A"},"-","-","-","-",600,45,null,"",null,{"$error":"#N/A"},{"$f":"IF(ISERR($I13),NA(),$B$5-($B$5-$B$16)/$F$19*SUM($I$5:$I13))","v":-9.8806692635005504},-9.8806692635005504,262.58657380747871,{"$f":"$U$5-($U$5-$U$16)/$W$16*SUM($W$6:$W13)","v":{"$error":"#VALUE!"}},{"$f":"IF(B13=\"Films\",VLOOKUP(calcul!C13,données,6,0),F13/100*VLOOKUP(calcul!C13,données,6,0))","v":{"$error":"#VALUE!"}},{"$error":"#VALUE!"},28.452128440988929,{"$error":"#VALUE!"},null,false,{"$f":"IF(ISERR($I13),NA(),20-30/$F$19*SUM($I$5:$I13))","v":-9.8806692635005504},262.58657380747871,{"$f":"$AD$5-($AD$5-$AD$16)/$W$16*SUM($W$6:$W13)","v":{"$error":"#VALUE!"}},{"$error":"#VALUE!"},"Qevap",{"$f":"AG11*AG12*24*3600","v":1518.4419177287307}]
[null,null,null,{"$error":"#N/A"},false,"-",{"$error":"#N/A"},"-","-","-","-",600,45,null,"",null,{"$error":"#N/A"},{"$f":"IF(ISERR($I14),NA(),$B$5-($B$5-$B$16)/$F$19*SUM($I$5:$I14))","v":-9.8806692635005504},-9.8806692635005504,262.58657380747871,{"$f":"$U$5-($U$5-$U$16)/$W$16*SUM($W$6:$W14)","v":{"$error":"#VALUE!"}},{"$f":"IF(B14=\"Films\",VLOOKUP(calcul!C14,données,6,0),F14/100*VLOOKUP(calcul!C14,données,6,0))","v":{"$error":"#VALUE!"}},{"$error":"#VALUE!"},28.452128440988929,{"$error":"#VALUE!"},null,false,{"$f":"IF(ISERR($I14),NA(),20-30/$F$19*SUM($I$5:$I14))","v":-9.8806692635005504},262.58657380747871,{"$f":"$AD$5-($AD$5-$AD$16)/$W$16*SUM($W$6:$W14)","v":{"$error":"#VALUE!"}},{"$error":"#VALUE!"},"Pot évaporation",{"$f":"AG13-AG9","v":829.57740371074965}]
[null,null,null,{"$error":"#N/A"},false,"-",{"$error":"#N/A"},"-","-","-","-",600,45,null,"",null,{"$error":"#N/A"},{"$f":"IF(ISERR($I15),NA(),$B$5-($B$5-$B$16)/$F$19*SUM($I$5:$I15))","v":-9.8806692635005504},-9.8806692635005504,262.58657380747871,{"$f":"$U$5-($U$5-$U$16)/$W$16*SUM($W$6:$W15)","v":{"$error":"#VALUE!"}},{"$f":"IF(B15=\"Films\",VLOOKUP(calcul!C15,données,6,0),F15/100*VLOOKUP(calcul!C15,données,6,0))","v":{"$error":"#VALUE!"}},{"$error":"#VALUE!"},28.452128440988929,{"$error":"#VALUE!"},null,true,{"$f":"IF(ISERR($I15),NA(),20-30/$F$19*SUM($I$5:$I15))","v":-9.8806692635005504},262.58657380747871,{"$f":"$AD$5-($AD$5-$AD$16)/$W$16*SUM($W$6:$W15)","v":{"$error":"#VALUE!"}},{"$error":"#VALUE!"}]
[null,-10,0.8,null,null,"Situation : ",{"$f":"COUNTIF(G6:G15,TRUE)","v":7},"mur",0.04,"Résistance superficielle",null,null,null,"Chènevotte",null,null,{"$error":"#N/A"},{"$f":"IF(ISERR($I16),NA(),$B$5-($B$5-$B$16)/$F$19*SUM($I$5:$I16))","v":-10.000000000000004},{"$f":"R16","v":-10.000000000000004},259.821649381562,{"$f":"T16*C16","v":207.85731950524962},{"$f":"SUM(IF(ISNUMBER(V6:V15),V6:V15))","v":6.479004999999999},{"$f":"SUM(IF(ISNUMBER(W6:W15),W6:W15))","v":34986627000},null,27.732623202806565,null,null,{"$f":"IF(ISERR($I16),NA(),20-30/$F$19*SUM($I$5:$I16))","v":-10.000000000000004},259.821649381562,{"$f":"AC16*80%","v":207.85731950524962},51.964329876312377]
[null,null,null,null,null,null,null,null,null,null,null,null,null,null,null,null,null,{"$f":"T17*V17*W17","v":1},{"$f":"R17","v":1},{"$f":"ISNUMBER(T16)","v":true},null,{"$f":"ISNUMBER(INDEX(V6:V16,G16))","v":true},{"$f":"ISNUMBER(INDEX(W6:W16,G16))","v":true},null,null,"Objectif : 1,06Kj/m²K"]
[null,null,"épaisseur","U",null,"R =1/U",null,"dephasage","Poids"]
[null,"TOTAL =",{"$f":"SUM(IF(ISNUMBER(F6:F15),F6:F15))","v":50.1},{"$f":"1/F19","v":9.9442280416212794E-2},null,{"$f":"SUM(IF(ISNUMBER(I5:I16),I5:I16))","v":10.056084754035496},null,{"$f":"SUM(IF(ISNUMBER(J6:J15),J6:J15))","v":17.927341858624555},{"$f":"SUM(IF(ISNUMBER(K6:K15),K6:K15))","v":57.3005}]

{"sheet":"Aide","index":3,"n_rows":0,"n_cols":0,"rows_kept":0,"cut":false,"hidden":true,"merged":[]}

{"sheet":"données","index":4,"n_rows":183,"n_cols":19,"rows_kept":183,"cut":false,"hidden":false,"merged":[]}
[null,"Epaisseur (cm)","Masse volumique (Kg/m3)","Chaleur spécifique (Wh/Kg.K)","Lambda (W/mK)","R diff vapeur (µ)\nSd (m) pour les Films","Effusivité (J/Ksm) =√(λρc)","Energie grise (Kwh/m3)","feu (EN 13 501-1)","format standard","Classe",null,null,null,null,null,"entraxe (cm)",null,"isolant"]
["Forfait RT 2005 : R=0,13",5,0.01,0.01,5.5585405789316943E-2,1E-4,{"$f":"SQRT(C2*D2*3600*E2)","v":0.1414593442800938},null,null,null,"Bardage_ventile"]
["Bloc béton (Parpaing de ciment)",20,1100,0.27777777777777779,0.95199999999999996,10,1023.3279044372825,275,null,null,"Blocs"]
["Bloc pierre ponce type Cogetherm",null,700,0.27777777777777779,0.13300000000000001,15,305.12292604784716,161,null,null,"Blocs"]
["Brique à alvéoles",30,850,0.25,0.14899999999999999,8,337.61664650902509,null,null,null,"Blocs"]
["Brique à alvéoles 37,5",37.5,782,0.22000000000002701,0.60000000000036402,35,609.59527557246622,null,null,null,"Blocs"]
["Brique Argelis 20",20,720,0.22000000000002701,1.69000000000051,35,981.68508188747023,null,null,null,"Blocs"]
["Brique creuse à joints minces",20,650,0.25,0.26700000000000002,8,395.21513128927643,null,null,null,"Blocs"]
["Brique creuse standard",20,650,0.25,0.45,8,513.07894129461204,null,null,null,"Blocs"]
["Brique Gélis 37,5",37.5,808,0.22,0.5,35,565.65713997084845,null,null,null,"Blocs"]
["Brique standard 20 cm",20,650,0.27777777777777779,0.39,13,503.48783500696419,696,null,null,"Blocs"]
["Briques pleines (cuites)",null,1850,0.27777777777777779,1,10,1360.1470508735442,1443,null,null,"Blocs"]
["Briquettes de parement",null,1850,0.27777777777777779,0.83299999999999996,10,1241.3903495677739,500,null,null,"Blocs"]
["Hourdi terre cuite",16,1111,0.22,4.76,35,2046.5534735256736,null,null,null,"Blocs"]
["Hourdis béton",12,1300,0.180000000000064,9.0899999999965093,10,2767.2036426688555,null,null,null,"Blocs"]
["Hourdis PPB ISO5 4",25,1527,0.260000000000218,0.65999999999985404,null,971.24637451090769,null,null,null,"Blocs"]
["Meulières",null,2200,0.27777777777777779,1.8,45,1989.9748742132399,0,null,null,"Blocs"]
["Monomur",null,740,0.27777777777777779,0.12,13,297.99328851502679,740,null,null,"Blocs"]
["Bois léger brut, séché à l'air (sapin, épicéa)",null,540,0.66666666666666663,0.14000000000000001,35,425.95774438317238,329,null,null,"Bois"]
["Bois léger, raboté, étuvé (sapin, épicéa)",null,500,0.66666666666666663,0.14000000000000001,35,409.87803063838396,610,null,null,"Bois"]
["Bois lourd (hêtre, chêne)",null,800,0.75,0.2,35,657.26706900619934,560,null,null,"Bois"]
["Linoléum naturel",null,700,0.53,8.1000000000000003E-2,1800,328.91275438936691,null,null,null,"Bois"]
["Etancheité PVC BRAS RHENOFOL (Sd=2400m)",null,1.5,0.28000000000000003,0.16,2400,null,null,null,null,"Films"]
["Freine vapeur (Sd=100m)",null,130,0.63888888888888884,2.2999999999999998,100,{"$f":"SQRT(C24*D24*3600*E24)","v":829.27679335671735},0,null,null,"Films"]
["Freine vapeur (Sd=10m)",null,130,0.63888888888888884,2.2999999999999998,10,829.27679335671735,0,null,null,"Films"]
["Freine vapeur (Sd=1m)",null,130,0.63888888888888884,2.2999999999999998,1,829.27679335671735,0,null,null,"Films"]
["Freine vapeur (Sd=20m)",null,130,0.63888888888888884,2.2999999999999998,20,829.27679335671735,0,null,null,"Films"]
["Freine vapeur (Sd=2m)",null,130,0.63888888888888884,2.2999999999999998,2,829.27679335671735,0,null,null,"Films"]
["Freine vapeur (Sd=50m)",null,130,0.63888888888888884,2.2999999999999998,50,829.27679335671735,0,null,null,"Films"]
["Freine vapeur (Sd=5m)",null,130,0.63888888888888884,2.2999999999999998,5,829.27679335671735,0,null,null,"Films"]
["Freine vapeur ISOVER VARIO DUPLEX(Sd=0,2 à 4,5m / compté 3m)",null,80,0.63888888888888884,2.2999999999999998,3,null,{"$f":"SQRT(C31*D31*3600*E31)","v":650.53823869162363},0,null,"Films"]
["Papier Kraft (Sd = 3m)",null,120,0.41666666666666669,0.42,3,{"$f":"SQRT(C32*D32*3600*E32)","v":274.95454169735041},0,null,null,"Films"]
["Papier-peint vinyl (Sd = 12m)",null,829,0.63888888888888884,100,12,13808.330818748513,0,null,null,"Films"]
["Pare-pluie (Sd=0,05)",null,130,0.63888888888888884,2.2999999999999998,0.05,829.27679335671735,0,null,null,"Films"]
["Pare-pluie (Sd=0,1)",null,130,0.63888888888888884,2.2999999999999998,0.1,829.27679335671735,0,null,null,"Films"]
["Pare-pluie (Sd=0,2)",null,130,0.63888888888888884,2.2999999999999998,0.2,829.27679335671735,0,null,null,"Films"]
["Pare-pluie (Sd=0,5)",null,130,0.63888888888888884,2.2999999999999998,0.5,829.27679335671735,0,null,null,"Films"]
["Pare-Vapeur (Sd=1500m)",null,130,0.63888888888888884,2.2999999999999998,1500,829.27679335671735,0,null,null,"Films"]
["cellulose",null,55,0.39,3.9E-2,1.4,54.877864389934125,null,null,null,"Isolants_et_plastiques"]
["cellulose (panneau)",null,100,0.39,0.04,1.4,74.939975980780773,null,null,null,"Isolants_et_plastiques"]
["Cellulose injectée",null,55,0.52777777777777779,4.2000000000000003E-2,1,66.249528300207544,98,null,null,"Isolants_et_plastiques"]
["cellulose soufflée",null,23,0.39,4.2999999999999997E-2,1.4,37.263333184244267,null,null,null,"Isolants_et_plastiques"]
["Chènevotte",null,110,0.54,4.8000000000000001E-2,null,101.31298041218609,null,null,null,"Isolants_et_plastiques"]
["Feutre bitumeux",null,1700,0.27799999999979302,0.5,null,922.32315378036924,null,null,null,"Isolants_et_plastiques"]
["Fibre de bois à insuffler",null,38,0.58299999999999996,0.04,0.5,56.481643035591659,null,null,null,"Isolants_et_plastiques"]
["Icynene",null,25,0.3,3.9E-2,1000000000,32.449961479175904,null,null,null,"Isolants_et_plastiques"]
["Isochanvre Construction",null,550,0.39,0.13,1.3,316.83749778080244,null,null,null,"Isolants_et_plastiques"]
["Laine de chanvre, lin, coton",null,40,0.44444444444444442,0.04,1,50.596442562694072,48,null,null,"Isolants_et_plastiques"]
["Laine de mouton et autres fibres animales",null,35,0.44444444444444442,0.06,1,57.965506984757752,56,null,null,"Isolants_et_plastiques"]
["Laine de roche 110kg/m3",null,113,0.28611111111111109,4.3999999999999997E-2,1,71.562280567349163,697,null,null,"Isolants_et_plastiques"]
["Laine de roche 140kg/m3",null,138,0.28611111111111109,4.5999999999999999E-2,1,80.860620823735943,851,null,null,"Isolants_et_plastiques"]
["Laine de roche 160kg/m3",null,163,0.28611111111111109,4.7E-2,1,88.830343914678153,1006,null,null,"Isolants_et_plastiques"]
["Laine de roche 20kg/m3 (rouleaux)",null,20,0.28611111111111109,0.05,1,32.09361307176242,123,null,null,"Isolants_et_plastiques"]
["Laine de roche 70kg/m3",null,70,0.28611111111111109,4.2000000000000003E-2,1,55.029083219693923,432,null,null,"Isolants_et_plastiques"]
["Laine de roche en vrac",null,35,0.28611111111111109,6.5000000000000002E-2,1,48.407127574356231,216,null,null,"Isolants_et_plastiques"]
["Laine de Verre - Isover Isoconfort 32",null,30,0.28599999999999998,3.2000000000000001E-2,1,null,{"$f":"SQRT(C56*D56*3600*E56)","v":31.439083956120605},null,null,"Isolants_et_plastiques"]
["Laine de verre 100kg/m3",null,100,0.28611111111111109,3.9E-2,1,{"$f":"SQRT(C57*D57*3600*E57)","v":63.3798075099633},null,null,null,"Isolants_et_plastiques"]
["Laine de verre 18kg/m3 (rouleaux)",null,18,0.28611111111111109,4.3999999999999997E-2,1,28.561512564988565,242,null,null,"Isolants_et_plastiques"]
["Laine de verre 35kg/m3",null,35,0.28611111111111109,3.9E-2,1,37.495999786643907,470,null,null,"Isolants_et_plastiques"]
["Laine de verre 60kg/m3",null,60,0.28611111111111109,3.7999999999999999E-2,1,48.460293024289477,806,null,null,"Isolants_et_plastiques"]
["Laine de verre 80kg/m3",null,80,0.28611111111111109,3.5000000000000003E-2,1,53.702886328390207,1344,null,null,"Isolants_et_plastiques"]
["Liège expansé conforme norme NF EN 13170",null,125,0.43333333333333335,4.9000000000000002E-2,1,97.749680306382601,450,null,null,"Isolants_et_plastiques"]
["Mousse de polyuréthanne 30kg/m3 (plaques moulées)",null,34,0.40277777777777779,2.9000000000000001E-2,150,37.811373950175366,974,null,null,"Isolants_et_plastiques"]
["Mousse de polyuréthanne 30kg/m3 (plaques moulées)",null,34,0.40277777777777779,2.9000000000000001E-2,150,null,{"$f":"SQRT(C64*D64*3600*E64)","v":37.811373950175366},974,null,"Isolants_et_plastiques"]
["Paille (bottes à plat)",45,83,0.37,0.05,1,{"$f":"SQRT(C65*D65*3600*E65)","v":74.349176189114559},0,null,null,"Isolants_et_plastiques"]
["Paille (bottes sur chant)",35,83,0.37,4.4999999999999998E-2,1,70.533821674427926,0,null,null,"Isolants_et_plastiques"]
["Paille compactée",null,350,0.39,0.12,null,242.83327613817676,null,null,null,"Isolants_et_plastiques"]
["Panneau de liège",null,120,0.39,0.04,10,82.092630607137949,85,null,null,"Isolants_et_plastiques"]
["Panneau de roseaux",null,225,0.39,5.6000000000000001E-2,10,133.00526305376039,null,null,null,"Isolants_et_plastiques"]
["Panneaux laine de bois 140 kg / m3",null,140,0.58333333333333337,4.2000000000000003E-2,5,111.12155506471281,161,null,null,"Isolants_et_plastiques"]
["Panneaux laine de bois 190 kg / m3",null,190,0.58333333333333337,0.05,5,141.24446891825536,219,null,null,"Isolants_et_plastiques"]
["Panneaux laine de bois 50 kg / m3",null,50,0.58333333333333337,3.9E-2,5,63.992187023104627,58,null,null,"Isolants_et_plastiques"]
["Perlite en vrac",null,70,0.25,0.06,2,61.481704595757591,329,null,null,"Isolants_et_plastiques"]
["Perlite expansée 200 kg/m3 (plaques)",null,200,0.25,0.06,20,103.92304845413264,940,null,null,"Isolants_et_plastiques"]
["Polycarbonate",null,1200,0.35,0.23,1000000000,589.71179401466952,null,null,null,"Isolants_et_plastiques"]
["Polystyrène expansé",null,18,0.40277777777777779,3.9E-2,60,31.904545130749003,500,null,null,"Isolants_et_plastiques"]
["Polystyrène expansé RT+",null,18,0.40277777777777779,3.2000000000000001E-2,60,28.899826989101509,null,null,null,"Isolants_et_plastiques"]
["Polystyrène extrudé (Plaques expansées aux HCFC)",null,34,0.40277777777777779,3.5000000000000003E-2,150,41.539138171127242,795,null,null,"Isolants_et_plastiques"]
["polyuréthane",16,35,0.23300000000000001,2.7E-2,1000000000,28.154324712200079,1100,null,null,"Isolants_et_plastiques"]
["polyuréthane canadienne",null,6.1,0.23300000000000001,3.7999999999999999E-2,3.3,13.943953528321872,null,null,null,"Isolants_et_plastiques"]
{"$rows_left_out":104}
{"sheet":"sauvegarde","index":5,"n_rows":20,"n_cols":12,"rows_kept":20,"cut":false,"hidden":true,"merged":[]}
["Un exemple","Panneaux","Plaque plâtre BA...",1.3,600,45,null,"mur","Un exemple",null,null,"Bardage_ventile"]
["...","Ossature_bois","Ossature bois 1",8,600,45,"cellulose",null,"Exemple avec condensation",null,null," Blocs"]
["...","Films","Freine vapeur (Sd=5m)",0.4,600,45,null,null,null,null,null," Bois"]
["...","Ossature_bois","Ossature bois 2",18,600,45,"cellulose",null,null,null,null," Films"]
["...","Panneaux","Panneau OSB",1,600,45,null,null,null,null,null," Isolants_et_plastiques"]
["...","Films","Pare-pluie (Sd=0,1)",0.4,600,45,null,null,null,null,null," Lame_dair"]
["...","Bardage_ventile","Forfait RT 2005 : R=0,13",5,600,45,null,null,null,null,null," Mortiers_et_plâtres"]
["...",null,null,"-",600,45,null,null,null,null,null," Ossature_bois"]
["...",null,null,"-",600,45,null,null,null,null,null," Panneaux"]
["...",null,null,"-",600,45,null,null,null,null,null," Pierres_et_betons"]
["Exemple avec condensation","Panneaux","Plaque plâtre BA...",1.3,600,45,null,"mur",null,null,null," test"]
["...","Ossature_bois","Ossature bois 1",24,600,45,"cellulose",null,null,null,null," Verres_et_metaux"]
["...","Films","Freine vapeur (Sd=5m)",0.4,600,45]
["...","Ossature_bois","Ossature bois 2",18,600,45,"cellulose"]
["...","Panneaux","Panneau OSB",1,600,45]
["...","Films","Pare-pluie (Sd=0,1)",0.4,600,45]
["...","Bardage_ventile","Forfait RT 2005 : R=0,13",5,600,45]
["...",null,null,"-",600,45]
["...",null,null,"-",600,45]
["...",null,null,"-",600,45]